program: Orca
programVersion: 5.0.4
elementType: C C F F C C C C C C H H H H H H H H
charge: 0
multiplicity: 1
keywords: SP DSD-BLYP D3BJ def2-QZVPP def2-QZVPP/C def2/J TightSCF
formula: C8H8F2
InChI: InChI=1/C8H8F2/c1-8(9,10)7-5-3-2-4-6-7/h2-6H,1H3
18 atoms
C  2.270957 -0.37644 0.796507
C  1.363383 0.15489 -0.28783
F  1.657264 -0.474611 -1.461751
F  1.635727 1.475757 -0.49287
C  -0.102141 -0.01265 0.022424
C  -0.789339 0.979628 0.710873
C  -2.124836 0.803822 1.038641
C  -2.783539 -0.36287 0.682384
C  -2.099761 -1.354709 -0.004207
C  -0.764308 -1.18171 -0.333416
H  3.318571 -0.234678 0.530055
H  2.09068 -1.439022 0.952921
H  2.076315 0.135617 1.737603
H  -0.29014 1.897053 0.992164
H  -2.652315 1.583921 1.571273
H  -3.826175 -0.498293 0.937645
H  -2.60791 -2.266135 -0.289814
H  -0.244821 -1.96163 -0.873902
totalener: -508.12514017 hartree
nucrepener: 525.12669386 hartree
electener: -1033.25183403 hartree
oneelecener: -1737.42185856 hartree
twoeener: 704.17002453 hartree
kineticenergy: 506.93598224 hartree
exchangeener: -20.061788603632 hartree
correlationener: -1.380888223858 hartree
xcener: -21.442676827491 hartree
chargesum: 0.0000000
charge: -0.184798 0.522015 -0.307261 -0.307365 0.111580 -0.137542 -0.098048 -0.094245 -0.096735 -0.140379 0.081193 0.086781 0.087697 0.097079 0.095221 0.092753 0.095019 0.097033
charge: 0.249791 -0.828188 0.357724 0.357849 -0.099085 0.088940 0.069816 0.068973 0.069892 0.088925 -0.052235 -0.047341 -0.047475 -0.051081 -0.058428 -0.058666 -0.058460 -0.050952
qa: -0.1848 0.5220 -0.3073 -0.3074 0.1116 -0.1375 -0.0980 -0.0942 -0.0967 -0.1404 0.0812 0.0868 0.0877 0.0971 0.0952 0.0928 0.0950 0.0970
va: 3.8388 3.9164 0.9601 0.9602 3.5090 3.7539 3.8217 3.8315 3.8213 3.7551 1.0092 0.9990 0.9984 1.0008 0.9874 0.9868 0.9876 1.0003
total: -509.057558930 hartree
dispersion: -0.011646809 hartree
energy: -509.069205738636 hartree
dipole: -5.05470 4.66111 -0.39360 -3.53866 3.11943 -0.41923 7.02528 -6.18724 0.83804
magnitude: 1.01636 au
magnitude: 2.58338 debye
