program: Orca
programVersion: 5.0.4
elementType: C C C C C C C C O H H H H H H H H
charge: 0
multiplicity: 1
keywords: Freq RIJCOSX PBEh-3c
frequency: 0.00 0.00 0.00 0.00 0.00 0.00 60.24 158.96 183.52 231.94 381.66 424.96 443.52 480.53 617.15 630.11 644.02 730.02 768.05 807.33 896.79 986.06 996.77 1038.37 1044.81 1060.53 1084.24 1089.54 1135.92 1148.47 1217.19 1242.96 1332.56 1382.64 1406.73 1450.77 1524.84 1531.82 1533.69 1584.39 1703.19 1725.41 1885.07 3121.38 3196.45 3243.34 3266.10 3274.32 3282.18 3290.76 3296.62
frequency: 60.24 158.96 183.52 231.94 381.66 424.96 443.52 480.53 617.15 630.11 644.02 730.02 768.05 807.33 896.79 986.06 996.77 1038.37 1044.81 1060.53 1084.24 1089.54 1135.92 1148.47 1217.19 1242.96 1332.56 1382.64 1406.73 1450.77 1524.84 1531.82 1533.69 1584.39 1703.19 1725.41 1885.07 3121.38 3196.45 3243.34 3266.10 3274.32 3282.18 3290.76 3296.62
formula: C8H8O
InChI: InChI=1/C8H8O/c1-7(9)8-5-3-2-4-6-8/h2-6H,1H3
17 atoms
C  2.681243 0.237846 0.268667
C  1.644149 -0.573064 -0.470029
C  0.203661 -0.263677 -0.225849
C  -0.202454 0.775665 0.607643
C  -1.549749 1.037625 0.803117
C  -2.505488 0.257912 0.170612
C  -2.110659 -0.78305 -0.659873
C  -0.766333 -1.040799 -0.858483
O  1.964963 -1.447358 -1.237997
H  2.596077 1.299272 0.030059
H  3.677019 -0.10232 -0.003423
H  2.559329 0.139596 1.348782
H  0.528025 1.394402 1.112079
H  -1.85241 1.850883 1.449062
H  -3.557336 0.46086 0.323733
H  -2.855045 -1.393912 -1.153165
H  -0.454893 -1.849983 -1.505037
totalener: -384.06565057 hartree
nucrepener: 403.17139132 hartree
electener: -787.23704189 hartree
oneelecener: -1318.47667426 hartree
twoeener: 531.23963237 hartree
kineticenergy: 381.18101228 hartree
exchangeener: -29.315640625343 hartree
correlationener: -2.782483290276 hartree
xcener: -32.098123915619 hartree
energy: -530.2400 -286.7827 -284.7588 -284.6967 -284.6952 -284.6120 -284.5638 -284.5466 -284.1402 -31.4921 -26.4386 -23.7511 -23.1552 -22.4118 -19.4599 -18.8428 -17.1922 -15.9586 -14.6810 -14.4233 -14.0495 -13.8124 -13.4513 -13.1879 -12.2833 -11.9957 -11.4676 -11.1978 -11.0734 -8.4516 -8.3658 -8.2646 -0.9238 0.2529 1.9331 3.6121 4.4021 5.1999 5.3478 5.4207 5.5356 6.1062 6.4984 6.6152 6.8319 7.9354 8.6591 8.8319 9.1679 10.0055 10.8910 13.2044 13.5565 14.2360 14.6553 15.2779 15.5047 15.6515 15.8506 16.5861 16.7489 16.9290 17.1641 17.2893 17.6281 17.8609 19.1498 19.3489 19.7882 20.4961 20.5311 20.6459 23.1128 25.3572 25.6497 25.6960 26.3313 26.9747 27.1352 27.3525 28.0015 28.4201 28.6316 28.8634 29.2833 29.6300 30.9157 30.9751 31.1490 31.7640 35.0988 35.2096 35.8628 36.4060 37.1585 37.7542 39.9414 40.0858 40.2088 41.7323 41.8193 42.3567 42.8979 46.8574 49.1973 49.3280 50.0883 50.9527 51.4645 52.1225 53.4219 55.9420 56.1064 56.6307 56.9235 57.9891 59.3564 59.6890 59.7706 60.1164 60.9819 61.4869 63.1706 63.6899 64.0410 64.4935 66.3946 68.3938 70.0175 71.7915 71.8253 72.7050 74.4801 74.9919 75.5100 76.1151 77.5499 79.4032 82.1438 83.0306 88.1709 95.0518 359.8718 370.0858 371.4427 375.4900 380.8763 384.7399 385.3649 396.0285 700.4691 electronvolt
chargesum: -0.0000000
charge: -0.786030 0.363033 -0.014848 -0.270241 -0.203071 -0.220666 -0.209074 -0.237427 -0.332905 0.240411 0.270365 0.241916 0.221808 0.225542 0.227757 0.227137 0.256295
charge: -0.392469 0.110227 -0.100837 -0.117106 -0.135828 -0.116087 -0.133375 -0.091263 -0.185719 0.147832 0.153535 0.148358 0.139601 0.138692 0.139362 0.139620 0.155459
qa: -0.7860 0.3630 -0.0148 -0.2702 -0.2031 -0.2207 -0.2091 -0.2374 -0.3329 0.2404 0.2704 0.2419 0.2218 0.2255 0.2278 0.2271 0.2563
va: 3.6458 3.9597 3.6151 3.7708 3.8143 3.8154 3.7891 3.7984 2.2518 0.9036 0.9030 0.9027 0.9147 0.9091 0.9085 0.9090 0.9090
dispersion: -0.009594155 hartree
energy: -384.051318597120 hartree
dipole: 0.58095 -1.12625 -0.54530 3.26632 -2.46921 0.79711 2.89714 -2.19791 0.69923
magnitude: 1.19233 au
magnitude: 3.03067 debye
temp: 298.15 k
press: 1.00 atm
zeropoint: 0.14246735 hartree
thermalvibcorrection: 0.00476030 hartree
thermalrotcorrection: 0.00141627 hartree
thermaltrasncorrection: 0.00141627 hartree
thermaltotal: -383.90125841 hartree
thermalcorr: 0.00759284 hartree
nonthermalcorr: 0.14246735 hartree
totalcorr: 0.15006019 hartree
thermalcorrenthalpy: 0.00094421 hartree
totalenthalpy: -383.90031420 hartree
vibrat: 0.00785730 hartree
rotat: 0.01364479 hartree
transl: 0.01913124 hartree
total: 0.04063333 hartree
totalentropycorr: -0.04063333 hartree
gibbsenthalpy: -383.94094753 hartree
gibbsminuselec: 0.11037107 hartree
