program: Orca
programVersion: 5.0.4
elementType: F C C C C C C C C C C C C C H H H H H H H H H H
charge: 1
multiplicity: 1
keywords: SP DSD-BLYP D3BJ def2-QZVPP def2-QZVPP/C def2/J TightSCF
formula: C13H10F
InChI: InChI=1/C13H10F/c14-13(11-7-3-1-4-8-11)12-9-5-2-6-10-12/h1-10H
24 atoms
F  0.274699 -0.440458 -2.109214
C  0.109064 -0.178664 -0.843651
C  -1.235677 -0.082994 -0.411508
C  -1.576181 -0.32106 0.936985
C  -2.890041 -0.23111 1.337372
C  -3.875265 0.098136 0.410958
C  -3.556301 0.313736 -0.927851
C  -2.250809 0.208409 -1.34839
C  1.300206 -0.028629 -0.092232
C  1.315867 0.755498 1.080331
C  2.486817 0.905979 1.788301
C  3.647981 0.277928 1.347448
C  3.650902 -0.48437 0.181557
C  2.494292 -0.626428 -0.549877
H  -0.82124 -0.637009 1.643494
H  -3.157178 -0.435199 2.364422
H  -4.905696 0.172463 0.732357
H  -4.333201 0.560749 -1.637285
H  -2.00767 0.385505 -2.386856
H  0.430914 1.29432 1.389497
H  2.507692 1.526135 2.67312
H  4.564474 0.395123 1.910299
H  4.561578 -0.961222 -0.151877
H  2.500522 -1.225051 -1.450285
totalener: -599.35186723 hartree
nucrepener: 795.33821840 hartree
electener: -1394.69008562 hartree
oneelecener: -2376.25954186 hartree
twoeener: 981.56945623 hartree
kineticenergy: 597.82125218 hartree
exchangeener: -25.123575687676 hartree
correlationener: -1.767254749539 hartree
xcener: -26.890830437215 hartree
chargesum: 1.0000000
charge: -0.173683 0.323239 0.129424 -0.065257 -0.105621 -0.007334 -0.095460 -0.074116 0.132226 -0.068973 -0.103288 -0.006751 -0.099842 -0.072276 0.127960 0.128497 0.136262 0.126613 0.125618 0.127216 0.128037 0.135416 0.128485 0.123607
charge: 0.521409 -0.274872 -0.097903 0.138037 0.107379 0.153800 0.111379 0.150997 -0.098123 0.136994 0.107279 0.153117 0.111208 0.150408 -0.035814 -0.041955 -0.032832 -0.040652 -0.034107 -0.035883 -0.041978 -0.033031 -0.040685 -0.034172
qa: -0.1737 0.3232 0.1294 -0.0653 -0.1056 -0.0073 -0.0955 -0.0741 0.1322 -0.0690 -0.1033 -0.0068 -0.0998 -0.0723 0.1280 0.1285 0.1363 0.1266 0.1256 0.1272 0.1280 0.1354 0.1285 0.1236
va: 1.1329 3.5292 3.5527 3.7031 3.8291 3.8005 3.8443 3.7476 3.5461 3.7020 3.8285 3.8023 3.8426 3.7479 0.9814 0.9829 0.9727 0.9826 0.9859 0.9811 0.9826 0.9726 0.9822 0.9860
total: -600.534292477 hartree
dispersion: -0.019500212 hartree
energy: -600.553792688651 hartree
dipole: -0.87352 0.77888 -0.09464 1.41738 -1.28901 0.12838 6.72656 -6.11436 0.61220
magnitude: 0.63264 au
magnitude: 1.60804 debye
