program: Orca
programVersion: 5.0.4
elementType: C C C C C C C C C C C C C H H H H H H H H H H
charge: 2
multiplicity: 1
keywords: SP DSD-BLYP D3BJ def2-QZVPP def2-QZVPP/C def2/J TightSCF
formula: C13H10
InChI: InChI=1/C13H10/c1-3-7-12(8-4-1)11-13-9-5-2-6-10-13/h1-10H
23 atoms
C  1.313194 0.143133 -0.031876
C  -0.000469 0.002401 -0.002533
C  -1.314244 -0.137748 0.025746
C  -2.137709 0.613346 -0.900901
C  -3.488691 0.45362 -0.852649
C  -4.052265 -0.430107 0.087017
C  -3.273733 -1.171232 0.995921
C  -1.918824 -1.041444 0.984447
C  1.945718 1.15976 0.785147
C  3.300906 1.280559 0.745968
C  4.053437 0.423895 -0.079563
C  3.462406 -0.56998 -0.882164
C  2.110087 -0.725366 -0.875588
H  -1.671836 1.284299 -1.610697
H  -4.129005 1.000958 -1.531071
H  -5.129953 -0.545043 0.111342
H  -3.753339 -1.838396 1.699283
H  -1.290492 -1.594519 1.670117
H  1.337407 1.801748 1.408601
H  3.800623 2.030089 1.344554
H  5.131745 0.534017 -0.097813
H  4.082955 -1.204309 -1.500515
H  1.624123 -1.478837 -1.481563
totalener: -499.19854744 hartree
nucrepener: 650.00202229 hartree
electener: -1149.20056973 hartree
oneelecener: -1933.77415034 hartree
twoeener: 784.57358061 hartree
kineticenergy: 497.85128280 hartree
exchangeener: -21.877742762034 hartree
correlationener: -1.556469562404 hartree
xcener: -23.434212324437 hartree
chargesum: 2.0000000
charge: 0.176517 0.087442 0.176492 -0.016449 -0.065472 0.103441 -0.066618 -0.016614 -0.019051 -0.065729 0.105448 -0.067745 -0.014653 0.164825 0.163060 0.184662 0.164942 0.164470 0.165021 0.164031 0.184297 0.163933 0.163750
charge: -0.078194 0.308360 -0.078193 0.218747 0.150522 0.265352 0.150436 0.218688 0.218625 0.150465 0.265426 0.150374 0.218772 -0.015857 -0.021485 -0.004923 -0.021484 -0.015945 -0.015924 -0.021507 -0.004908 -0.021494 -0.015853
qa: 0.1765 0.0874 0.1765 -0.0164 -0.0655 0.1034 -0.0666 -0.0166 -0.0191 -0.0657 0.1054 -0.0677 -0.0147 0.1648 0.1631 0.1847 0.1649 0.1645 0.1650 0.1640 0.1843 0.1639 0.1638
va: 3.5848 3.1190 3.5843 3.7247 3.8299 3.6912 3.8262 3.7252 3.7247 3.8276 3.6916 3.8289 3.7244 0.9672 0.9757 0.9545 0.9750 0.9672 0.9673 0.9753 0.9544 0.9755 0.9675
total: -500.229880672 hartree
dispersion: -0.018003072 hartree
energy: -500.247883743819 hartree
dipole: 0.00209 -0.00187 0.00022 -0.00938 0.00777 -0.00161 0.01148 -0.00959 0.00189
magnitude: 0.00249 au
magnitude: 0.00634 debye
