program: Orca
programVersion: 5.0.4
elementType: C F F F H
charge: 0
multiplicity: 1
keywords: Opt RIJCOSX PBEh-3c
formula: CHF3
InChI: InChI=1/CHF3/c2-1(3)4/h1H
5 atoms
C  0.00169 0.002929 0.060999
F  -0.231782 1.210518 -0.448342
F  -0.96575 -0.819895 -0.336429
F  1.156695 -0.444718 -0.42569
H  0.039147 0.051066 1.149462
totalener: -337.60869593 hartree
nucrepener: 134.02947788 hartree
electener: -471.63817381 hartree
oneelecener: -735.77178216 hartree
twoeener: 264.13360835 hartree
kineticenergy: 335.76611589 hartree
exchangeener: -20.028252343089 hartree
correlationener: -1.589651411406 hartree
xcener: -21.617903754494 hartree
dispersion: -0.000881110 hartree
energy: -683.9345 -683.9319 -683.9270 -291.0836 -39.4527 -36.9033 -36.8921 -21.9053 -18.7000 -18.2316 -18.2235 -14.8630 -14.8535 -13.8130 -13.8043 -13.2096 -12.4949 4.9393 5.4021 5.4285 7.2729 12.3980 12.7039 12.7055 17.5537 23.4785 25.9670 25.9731 29.4813 30.9220 30.9542 31.6192 32.0708 32.0825 32.3485 32.3594 33.7045 34.2107 34.2244 35.8216 36.1188 37.4063 37.4610 45.1525 45.2060 47.5966 51.1177 51.1493 51.2036 56.1249 60.3368 60.3578 66.4056 66.4245 67.8915 80.2906 80.3778 82.0316 383.1066 888.0334 888.0833 897.1035 electronvolt
chargesum: -0.0000000
charge: 0.750460 -0.295906 -0.295513 -0.295783 0.136742
charge: 0.321043 -0.137602 -0.137205 -0.137493 0.091257
qa: 0.7505 -0.2959 -0.2955 -0.2958 0.1367
va: 4.0264 1.1037 1.1039 1.1034 0.9353
dispersion: -0.000881104 hartree
energy: -337.583639922172 hartree
dipole: 0.05573 -0.03623 0.01950 0.07328 -0.04588 0.02740 1.64484 -1.04006 0.60478
magnitude: 0.60572 au
magnitude: 1.53961 debye
