program: Orca
programVersion: 5.0.4
elementType: F C F F
charge: 1
multiplicity: 1
keywords: Opt RIJCOSX PBEh-3c
formula: CF3
InChI: InChI=1/CF3/c2-1(3)4
4 atoms
F  -0.590375 1.08232 -0.002296
C  -0.000706 -0.000133 -0.00001
F  -0.640182 -1.05403 0.002387
F  1.231263 -0.028157 -0.000081
totalener: -336.59377722 hartree
nucrepener: 129.78845158 hartree
electener: -466.38222881 hartree
oneelecener: -713.81920244 hartree
twoeener: 247.43697363 hartree
kineticenergy: 334.69812730 hartree
exchangeener: -19.621038572478 hartree
correlationener: -1.507653930993 hartree
xcener: -21.128692503471 hartree
dispersion: -0.000651214 hartree
energy: -695.0143 -695.0125 -695.0104 -303.0726 -51.1418 -48.5616 -48.5536 -31.1536 -29.2492 -29.2440 -28.1623 -24.9767 -24.9690 -24.4592 -24.4538 -23.5253 -9.7207 -4.8577 0.6032 0.6411 3.6674 5.0021 5.0035 5.1632 17.8589 17.8742 19.4637 20.3872 20.4073 22.4550 23.8927 23.9085 23.9823 23.9873 25.2082 25.6773 25.6915 27.6007 27.7648 27.8171 27.8489 34.3268 34.3926 38.0437 41.1766 41.8163 46.8346 46.8761 50.1978 56.4771 56.4966 66.3840 66.4313 70.2284 70.5531 70.5988 379.3282 880.7530 880.7728 882.9497 electronvolt
chargesum: 1.0000000
charge: -0.040925 1.122572 -0.040999 -0.040649
charge: 0.153284 0.539981 0.153248 0.153487
qa: -0.0409 1.1226 -0.0410 -0.0406
va: 1.4459 3.9777 1.4459 1.4461
dispersion: -0.000651212 hartree
energy: -336.579181540454 hartree
dipole: -0.00046 -0.00140 -0.00185 -0.00009 -0.00027 -0.00035 -0.00001 -0.00002 -0.00002
magnitude: 0.00189 au
magnitude: 0.00480 debye
