program: Orca
programVersion: 5.0.4
elementType: F C F F
charge: 1
multiplicity: 1
keywords: SP DSD-BLYP D3BJ def2-QZVPP def2-QZVPP/C def2/J TightSCF
formula: CF3
InChI: InChI=1/CF3/c2-1(3)4
4 atoms
F  -0.590447 1.082306 -0.002297
C  -0.000777 -0.000147 -0.000011
F  -0.640254 -1.054043 0.002386
F  1.231192 -0.02817 -0.000082
totalener: -336.67721744 hartree
nucrepener: 129.78575900 hartree
electener: -466.46297644 hartree
oneelecener: -714.32226774 hartree
twoeener: 247.85929130 hartree
kineticenergy: 335.97137391 hartree
exchangeener: -10.930580582044 hartree
correlationener: -0.652987085617 hartree
xcener: -11.583567667661 hartree
energy: -710.6546 -710.6531 -710.6470 -313.7187 -54.3708 -51.7655 -51.7566 -33.3795 -31.2209 -31.2150 -29.8957 -26.8383 -26.8309 -26.2277 -26.2220 -25.5339 -7.6752 -4.2297 -1.6110 -1.1273 -1.1220 1.3572 2.6324 2.6422 4.3397 4.9472 4.9513 5.4115 5.4473 7.8078 8.7277 8.7407 8.9217 10.3693 10.5981 10.6159 13.8739 13.9126 13.9185 18.8392 18.9767 18.9818 24.1099 24.1182 32.7576 32.7955 33.5699 33.7476 35.9424 38.5160 38.5169 38.8355 38.8574 40.6285 40.6351 40.6456 40.6969 41.1095 41.1784 41.2183 43.4139 43.4237 44.7121 45.6706 49.4402 49.4547 52.7467 53.4775 53.4927 53.6488 53.6932 54.0744 65.8543 65.8938 67.4493 67.4544 69.9854 74.5490 74.5935 76.4067 77.5685 81.3658 87.0613 87.0741 102.9804 106.2072 106.2324 107.5077 107.5170 108.0455 108.3193 109.8901 113.9595 114.0075 118.1731 118.2090 120.2262 120.2497 120.3082 126.2300 126.6959 126.7233 131.3359 131.6805 131.7884 132.6709 135.5112 138.7900 138.8343 139.4763 139.5041 139.5203 143.7722 143.8188 143.9561 144.0119 147.3946 150.0961 150.1046 150.6568 151.7617 151.7665 154.9345 157.6587 157.6810 158.1476 158.2968 160.8119 160.8138 164.3422 164.3731 164.8889 164.8984 165.7590 165.7892 170.3483 170.4257 171.9528 171.9982 172.8239 176.4877 178.8783 192.5235 192.5530 203.2253 204.3129 205.1281 205.2771 205.3063 215.7202 215.9928 268.4278 268.5008 273.4727 308.1581 308.1647 308.3373 308.3504 308.3596 308.4825 308.5318 308.5358 309.2769 312.1680 312.5607 312.5835 316.7599 316.8103 317.0375 317.0773 324.0874 326.7251 326.7445 332.6884 332.7238 337.8060 338.8362 344.3645 346.1855 353.6628 353.7336 396.2730 396.2777 396.9691 397.3995 397.4019 398.1605 404.1993 404.2528 406.0988 406.1067 407.0215 407.9702 408.1272 408.1945 416.7724 426.7736 427.0390 427.0397 429.6577 429.6670 431.4004 432.2043 432.8470 432.8472 432.9737 439.6143 439.6162 441.7015 441.7163 442.9614 444.6593 447.4710 447.5769 456.8805 458.8710 459.0045 469.1359 469.1519 469.5690 768.0771 1498.8517 1498.8791 1500.2295 4027.4116 7817.3456 7817.3769 7818.5264 electronvolt
chargesum: 1.0000000
charge: 0.026681 0.919870 0.026690 0.026760
charge: 0.678051 -1.034493 0.677946 0.678496
qa: 0.0267 0.9199 0.0267 0.0268
va: 1.4852 4.2495 1.4852 1.4853
total: -337.138316540 hartree
dispersion: -0.000725684 hartree
energy: -337.139042224400 hartree
dipole: -0.00046 -0.00163 -0.00208 -0.00009 -0.00028 -0.00037 -0.00001 -0.00002 -0.00002
magnitude: 0.00212 au
magnitude: 0.00538 debye
