program: Orca
programVersion: 5.0.4
elementType: F C F O
charge: 0
multiplicity: 1
keywords: Opt RIJCOSX PBEh-3c
formula: CF2O
InChI: InChI=1/CF2O/c2-1(3)4
4 atoms
F  -0.643701 1.075697 0.043708
C  0.09445 -0.003268 -0.00426
F  -0.710681 -1.033514 0.014605
O  1.259931 -0.038915 -0.053953
totalener: -312.41697677 hartree
nucrepener: 120.27836332 hartree
electener: -432.69534009 hartree
oneelecener: -671.02707817 hartree
twoeener: 238.33173808 hartree
kineticenergy: 310.63932805 hartree
exchangeener: -18.796517454588 hartree
correlationener: -1.491952998331 hartree
xcener: -20.288470452919 hartree
dispersion: -0.000725869 hartree
energy: -685.1411 -685.1321 -531.9770 -291.6483 -40.1337 -38.0308 -33.5467 -21.2141 -19.2114 -17.9429 -17.1671 -15.2059 -14.9598 -14.6174 -12.6139 -11.5378 0.6689 3.9150 8.1222 10.0654 11.9074 12.7199 12.7246 18.1581 24.0074 26.6316 28.2477 28.7395 28.8479 29.5945 30.4907 31.6834 31.9996 32.7265 33.0336 34.0513 34.5028 36.9147 37.7428 38.1198 46.8990 48.3336 48.3808 51.7413 51.8596 51.9914 53.5461 54.5139 59.9816 64.9285 73.4645 75.9927 78.0834 78.3428 81.9508 82.7377 385.4655 697.7236 889.6122 890.8830 electronvolt
chargesum: 0.0000000
charge: -0.251883 0.832522 -0.251284 -0.329355
charge: -0.079164 0.269393 -0.078497 -0.111732
qa: -0.2519 0.8325 -0.2513 -0.3294
va: 1.1751 4.2789 1.1759 2.3033
energy: -312.404836227843 hartree
dipole: 1.14990 -1.59870 -0.44880 -0.03577 0.04815 0.01238 -0.04944 0.06828 0.01884
magnitude: 0.44937 au
magnitude: 1.14220 debye
