program: Orca
programVersion: 5.0.4
elementType: F C F F C H H H
charge: 0
multiplicity: 1
keywords: SP DSD-BLYP D3BJ def2-QZVPP def2-QZVPP/C def2/J TightSCF
formula: C2H3F3
InChI: InChI=1/C2H3F3/c1-2(3,4)5/h1H3
8 atoms
F  -0.546309 -0.228386 1.17904
C  0.054978 -0.002677 0.00448
F  -0.426198 -0.903678 -0.862555
F  -0.349295 1.202481 -0.417492
C  1.550466 -0.082676 0.118342
H  1.919391 0.660817 0.822536
H  1.850762 -1.068858 0.467708
H  2.013551 0.097848 -0.849966
totalener: -376.86401003 hartree
nucrepener: 202.07986844 hartree
electener: -578.94387848 hartree
oneelecener: -923.76890479 hartree
twoeener: 344.82502631 hartree
kineticenergy: 376.10437640 hartree
exchangeener: -12.975406561636 hartree
correlationener: -0.824226299708 hartree
xcener: -13.799632861344 hartree
chargesum: 0.0000000
charge: -0.277928 0.728896 -0.278584 -0.278436 -0.190301 0.098929 0.098684 0.098740
charge: 0.378767 -1.224302 0.376954 0.377603 0.237846 -0.048980 -0.048907 -0.048981
qa: -0.2779 0.7289 -0.2786 -0.2784 -0.1903 0.0989 0.0987 0.0987
va: 1.0205 4.1202 1.0199 1.0204 3.8565 0.9998 1.0000 0.9995
total: -377.433393936 hartree
dispersion: -0.002223726 hartree
energy: -377.435617661881 hartree
dipole: 6.65083 -5.67629 0.97454 -0.35626 0.30451 -0.05175 0.50664 -0.43067 0.07597
magnitude: 0.97886 au
magnitude: 2.48807 debye
