program: Orca
programVersion: 5.0.4
elementType: F C C O H H H
charge: 0
multiplicity: 1
keywords: Opt RIJCOSX PBEh-3c
formula: C2H3FO
InChI: InChI=1/C2H3FO/c1-2(3)4/h1H3
7 atoms
F  1.488541 -0.938842 0.299835
C  0.822139 0.183627 -0.031232
C  -0.651656 -0.050782 -0.002336
O  1.411057 1.169706 -0.295068
H  -0.966843 -0.342675 0.999686
H  -1.184676 0.847205 -0.29899
H  -0.918662 -0.868339 -0.671995
totalener: -252.59227392 hartree
nucrepener: 119.23046296 hartree
electener: -371.82273688 hartree
oneelecener: -583.22704772 hartree
twoeener: 211.40431084 hartree
kineticenergy: 251.01203437 hartree
exchangeener: -16.624334110829 hartree
correlationener: -1.433532515462 hartree
xcener: -18.057866626291 hartree
dispersion: -0.001863817 hartree
energy: -683.5763 -531.0595 -288.9999 -284.8773 -37.3510 -32.3977 -23.6137 -18.7782 -16.1349 -15.7987 -15.5022 -13.5018 -13.3857 -12.5925 -11.7126 -10.0853 0.6295 4.0106 4.8543 5.5456 5.7136 7.5767 9.5535 13.0776 13.4312 15.1207 15.1404 15.5057 18.5516 21.0211 24.9156 25.8784 27.2411 27.9560 29.5306 29.6558 31.5872 32.5602 32.6691 33.2038 34.4160 35.2853 38.1897 40.7442 43.4446 45.4928 48.9712 49.2649 51.0543 53.2613 53.3365 55.4848 57.7886 59.2974 61.4900 65.7107 66.6191 73.5025 76.4503 79.6826 81.6588 84.2194 371.6029 382.8661 698.4453 891.6022 electronvolt
chargesum: -0.0000000
charge: -0.304267 0.611324 -0.782512 -0.316071 0.264811 0.262437 0.264278
charge: -0.157650 0.207527 -0.397966 -0.134011 0.163209 0.156393 0.162499
qa: -0.3043 0.6113 -0.7825 -0.3161 0.2648 0.2624 0.2643
va: 1.1013 4.1049 3.6818 2.2893 0.8949 0.8967 0.8952
dispersion: -0.001863837 hartree
energy: -252.581600610458 hartree
dipole: -5.76623 4.69670 -1.06953 0.48123 -0.88515 -0.40391 -0.27368 0.36459 0.09090
magnitude: 1.14686 au
magnitude: 2.91509 debye
