program: Orca
programVersion: 5.0.4
elementType: F S C C C C C C O H H H H H
charge: 0
multiplicity: 1
keywords: Opt RIJCOSX PBEh-3c
formula: C6H5FOS
InChI: InChI=1/C6H5FOS/c7-9(8)6-4-2-1-3-5-6/h1-5H
14 atoms
F  2.731586 -0.910062 1.206877
S  2.614962 -0.022749 -0.16727
C  0.828292 -0.013242 -0.136539
C  0.160472 -1.17709 -0.486443
C  -1.223928 -1.195449 -0.452454
C  -1.920842 -0.055349 -0.07589
C  -1.239233 1.106603 0.258092
C  0.146662 1.135866 0.226927
O  3.047947 1.339491 0.136057
H  0.710656 -2.063677 -0.778714
H  -1.758219 -2.097966 -0.716198
H  -3.00208 -0.07274 -0.045788
H  -1.788721 1.992095 0.547875
H  0.692547 2.034269 0.483469
totalener: -803.56233234 hartree
nucrepener: 514.99525135 hartree
electener: -1318.55758369 hartree
oneelecener: -2126.06580243 hartree
twoeener: 807.50821875 hartree
kineticenergy: 800.10520718 hartree
exchangeener: -42.654471525404 hartree
correlationener: -3.409170755869 hartree
xcener: -46.063642281273 hartree
dispersion: -0.008463845 hartree
energy: -2442.6866 -683.0718 -530.4835 -285.4320 -285.2090 -285.0659 -285.0262 -284.9913 -284.9523 -228.1438 -170.8092 -170.7017 -170.5274 -36.2558 -31.6128 -26.9262 -24.1006 -23.5948 -21.2941 -19.3839 -18.7073 -16.9545 -15.7214 -15.2445 -15.0435 -14.4379 -14.3270 -13.8934 -13.2043 -12.3482 -12.0245 -11.8373 -11.5908 -10.5752 -8.9264 -8.7184 -8.5436 -0.9339 -0.1540 1.3074 1.9893 3.2341 4.5003 4.8499 4.9731 5.4353 6.1486 6.4968 7.7304 8.2986 8.3950 8.7647 11.2278 12.2759 13.4229 13.9344 14.6228 14.8929 15.2051 15.9608 16.1689 16.3058 16.4257 16.6018 16.7022 17.0060 17.4855 18.1172 18.4219 19.1588 20.2083 20.3155 21.0208 21.9733 23.6073 24.3343 24.7026 25.3717 25.9380 26.2827 26.9883 27.3665 28.0509 28.6066 28.9497 29.2477 29.7175 30.2507 31.0623 32.2449 32.9734 33.7534 34.2048 34.5430 34.7299 34.9140 35.3663 36.1172 37.1730 37.3430 39.2530 40.8772 41.3118 41.5286 41.8491 42.2344 43.3671 45.3912 46.4839 49.4405 49.5350 51.2518 51.5303 52.3599 54.1300 55.4738 56.1761 56.6694 57.9021 59.1608 59.4220 59.5431 59.5923 60.0578 60.8407 63.8737 64.0730 64.2932 69.4428 71.0614 73.8231 73.9885 74.5099 75.2572 75.8954 76.6248 76.7333 77.7480 83.2727 93.4506 359.4612 370.7939 370.8821 383.6708 384.0069 395.5624 695.6264 889.2348 electronvolt
chargesum: -0.0000000
charge: -0.445643 1.112251 -0.233854 -0.203958 -0.214198 -0.210154 -0.212588 -0.202045 -0.612449 0.242431 0.235136 0.234414 0.235731 0.274926
charge: -0.386431 1.020618 -0.220706 -0.124126 -0.127516 -0.113251 -0.125194 -0.113918 -0.546241 0.146167 0.143240 0.142975 0.143618 0.160765
qa: -0.4456 1.1123 -0.2339 -0.2040 -0.2142 -0.2102 -0.2126 -0.2020 -0.6124 0.2424 0.2351 0.2344 0.2357 0.2749
va: 0.8890 3.4536 3.7530 3.7589 3.8254 3.8023 3.8057 3.7824 1.9366 0.9057 0.9064 0.9066 0.9061 0.9001
dispersion: -0.008464141 hartree
energy: -803.549179208402 hartree
dipole: -11.03862 9.65937 -1.37925 0.64729 -1.18319 -0.53590 -1.88125 1.35144 -0.52981
magnitude: 1.57170 au
magnitude: 3.99493 debye
