program: Orca
programVersion: 5.0.4
elementType: F S C C C C C C H H H H H
charge: 2
multiplicity: 1
keywords: Freq RIJCOSX PBEh-3c
frequency: 0.00 0.00 0.00 0.00 0.00 0.00 86.60 177.23 189.30 288.75 349.96 369.27 490.85 554.58 575.74 732.21 804.32 814.46 982.45 992.17 1006.44 1021.43 1042.93 1050.95 1153.94 1176.33 1222.70 1287.12 1326.35 1431.70 1490.87 1529.54 1619.78 1721.16 3247.60 3265.49 3285.86 3292.61 3296.57
frequency: 86.60 177.23 189.30 288.75 349.96 369.27 490.85 554.58 575.74 732.21 804.32 814.46 982.45 992.17 1006.44 1021.43 1042.93 1050.95 1153.94 1176.33 1222.70 1287.12 1326.35 1431.70 1490.87 1529.54 1619.78 1721.16 3247.60 3265.49 3285.86 3292.61 3296.57
formula: C6H5FS
InChI: InChI=1/C6H5FS/c7-8-6-4-2-1-3-5-6/h1-5H
13 atoms
F  3.367733 -0.75162 -0.091171
S  2.633399 0.614854 -0.077454
C  1.051763 0.234056 -0.035861
C  0.159515 1.404796 -0.006945
C  -1.17613 1.189943 0.038591
C  -1.668022 -0.145144 0.054044
C  -0.809667 -1.290586 0.021428
C  0.531846 -1.126828 -0.022889
H  0.563221 2.413963 -0.019822
H  -1.87023 2.021116 0.063481
H  -2.742488 -0.304312 0.091576
H  -1.243663 -2.283034 0.032971
H  1.202622 -1.977304 -0.048049
totalener: -727.66814495 hartree
nucrepener: 411.64117199 hartree
electener: -1139.30931694 hartree
oneelecener: -1788.54881936 hartree
twoeener: 649.23950241 hartree
kineticenergy: 724.79744801 hartree
exchangeener: -37.650487485338 hartree
correlationener: -2.935081242796 hartree
xcener: -40.585568728134 hartree
energy: -2453.9129 -695.6593 -298.2886 -297.0581 -296.5803 -296.2793 -295.5474 -295.4869 -239.5938 -182.2320 -182.0649 -181.9931 -48.9665 -38.4239 -36.2923 -34.5414 -32.9649 -30.0709 -29.9307 -27.9948 -26.8680 -26.6009 -26.3518 -25.4338 -24.6786 -24.4958 -23.3666 -23.2636 -22.3653 -22.0094 -20.6542 -19.4302 -15.5931 -11.4215 -11.2008 -10.1810 -7.4448 -6.1522 -5.4419 -4.6770 -4.4898 -3.3566 -3.1148 -2.7209 -2.2367 -1.6814 -0.9739 -0.0176 1.8949 2.8583 3.0996 3.6624 4.1298 4.6614 4.7439 5.0030 5.5884 5.6712 6.1520 6.1824 6.6757 7.3814 7.4305 7.9549 8.2298 9.1402 9.8823 10.7053 11.6333 13.4129 13.9746 15.4693 15.8323 15.8507 16.4514 16.8158 17.1267 17.6583 18.2356 19.0131 19.5777 20.5532 21.5673 23.0870 23.4275 23.4995 23.6206 24.1593 24.5226 25.1206 25.3205 27.6765 28.6846 29.3005 30.4241 30.8183 31.1602 31.4592 31.7192 33.8779 36.8292 38.0679 38.7128 42.1561 44.0623 45.0604 45.6347 46.4634 46.6420 47.1827 48.6857 49.0637 50.6720 51.4817 54.1210 57.5213 60.4248 61.4069 61.6202 61.7644 64.1199 64.3989 65.6235 66.2954 71.5755 80.4359 348.5409 358.5019 359.4902 368.3715 373.5425 382.2587 877.4332 electronvolt
chargesum: 2.0000000
charge: -0.281409 1.182157 -0.175906 -0.142123 -0.160491 -0.071959 -0.159658 -0.118386 0.378382 0.385289 0.402779 0.386218 0.375106
charge: -0.203584 1.165568 -0.102611 -0.008281 -0.062649 0.179166 -0.044601 -0.019046 0.214641 0.220151 0.225575 0.219797 0.215873
qa: -0.2814 1.1822 -0.1759 -0.1421 -0.1605 -0.0720 -0.1597 -0.1184 0.3784 0.3853 0.4028 0.3862 0.3751
va: 1.1297 2.8469 3.6717 3.6039 3.6707 3.4332 3.6480 3.6269 0.8354 0.8311 0.8166 0.8304 0.8423
dispersion: -0.007560591 hartree
energy: -727.658086239397 hartree
dipole: -10.57055 8.78422 -1.78633 0.30930 0.15393 0.46323 0.30184 -0.25135 0.05049
magnitude: 1.84611 au
magnitude: 4.69243 debye
temp: 298.15 k
press: 1.00 atm
zeropoint: 0.09540343 hartree
thermalvibcorrection: 0.00422068 hartree
thermalrotcorrection: 0.00141627 hartree
thermaltrasncorrection: 0.00141627 hartree
thermaltotal: -727.55562958 hartree
thermalcorr: 0.00705322 hartree
nonthermalcorr: 0.09540343 hartree
totalcorr: 0.10245666 hartree
thermalcorrenthalpy: 0.00094421 hartree
totalenthalpy: -727.55468538 hartree
vibrat: 0.00700178 hartree
rotat: 0.01356894 hartree
transl: 0.01922268 hartree
total: 0.03979339 hartree
totalentropycorr: -0.03979339 hartree
gibbsenthalpy: -727.59447877 hartree
gibbsminuselec: 0.06360747 hartree
