program: Orca
programVersion: 5.0.4
elementType: F S C F F F C C C C C C H H H H H
charge: 1
multiplicity: 1
keywords: SP DSD-BLYP D3BJ def2-QZVPP def2-QZVPP/C def2/J TightSCF
formula: C7H5F4S
InChI: InChI=1/C7H5F4S/c8-7(9,10)12(11)6-4-2-1-3-5-6/h1-5H
17 atoms
F  1.365875 -0.587034 -1.613953
S  0.699138 -0.937335 -0.215698
C  1.641892 0.331655 0.806475
F  1.083831 0.263784 1.988779
F  1.541314 1.530312 0.299247
F  2.884528 -0.064453 0.836757
C  -0.901202 -0.328217 -0.335203
C  -1.882736 -1.210535 0.129672
C  -3.203311 -0.805296 0.080857
C  -3.524378 0.431594 -0.460631
C  -2.53644 1.282634 -0.95466
C  -1.209626 0.917942 -0.893765
H  -1.62389 -2.185453 0.524746
H  -3.979515 -1.461474 0.447458
H  -4.560675 0.736912 -0.512288
H  -2.808229 2.233032 -1.391704
H  -0.449521 1.573833 -1.293086
totalener: -1065.30005694 hartree
nucrepener: 865.92931851 hartree
electener: -1931.22937545 hartree
oneelecener: -3172.86760074 hartree
twoeener: 1241.63822529 hartree
kineticenergy: 1063.52672891 hartree
exchangeener: -32.085013141533 hartree
correlationener: -1.949331518408 hartree
xcener: -34.034344659940 hartree
chargesum: 1.0000000
charge: -0.251426 0.672801 0.676870 -0.171913 -0.183359 -0.162622 0.061310 -0.070459 -0.066085 -0.042941 -0.061590 -0.056576 0.121109 0.137387 0.142831 0.138616 0.116045
charge: 0.149888 0.824831 -1.419837 0.456639 0.463222 0.463948 -0.330712 0.086874 0.117567 0.153977 0.121729 0.096545 -0.038036 -0.037738 -0.030428 -0.036654 -0.041814
qa: -0.2514 0.6728 0.6769 -0.1719 -0.1834 -0.1626 0.0613 -0.0705 -0.0661 -0.0429 -0.0616 -0.0566 0.1211 0.1374 0.1428 0.1386 0.1160
va: 1.0523 3.2241 4.2481 1.1551 1.1473 1.1712 3.6636 3.7712 3.8170 3.8478 3.8081 3.7822 0.9937 0.9789 0.9739 0.9782 0.9948
total: -1066.490016647 hartree
dispersion: -0.013889731 hartree
energy: -1066.503906377842 hartree
dipole: -18.98266 17.38355 -1.59911 -0.19015 -0.29003 -0.48018 -3.48092 3.24031 -0.24061
magnitude: 1.68690 au
magnitude: 4.28775 debye
