program: Orca
programVersion: 5.0.4
elementType: O S C F F F C C C C C C H H H H H
charge: 0
multiplicity: 1
keywords: SP DSD-BLYP D3BJ def2-QZVPP def2-QZVPP/C def2/J TightSCF
formula: C7H5F3OS
InChI: InChI=1/C7H5F3OS/c8-7(9,10)12(11)6-4-2-1-3-5-6/h1-5H
17 atoms
O  1.038467 0.723081 -1.966924
S  0.700679 1.031722 -0.553133
C  1.667964 -0.200866 0.452799
F  1.452426 -1.447748 0.072364
F  1.3489 -0.071215 1.737166
F  2.954793 0.075893 0.298945
C  -0.901034 0.316817 -0.190013
C  -1.595847 0.733435 0.935144
C  -2.858979 0.215344 1.173995
C  -3.414304 -0.693896 0.284469
C  -2.714009 -1.083584 -0.848779
C  -1.448535 -0.576022 -1.096532
H  -1.167276 1.46063 1.613469
H  -3.412897 0.529019 2.048334
H  -4.403215 -1.091571 0.469922
H  -3.156515 -1.784356 -1.543813
H  -0.89831 -0.855835 -1.985151
totalener: -1040.96244019 hartree
nucrepener: 852.48595876 hartree
electener: -1893.44839895 hartree
oneelecener: -3128.86745285 hartree
twoeener: 1235.41905390 hartree
kineticenergy: 1039.19638806 hartree
exchangeener: -31.604196165021 hartree
correlationener: -1.939989726584 hartree
xcener: -33.544185891604 hartree
chargesum: 0.0000000
charge: -0.576703 0.547847 0.669536 -0.235134 -0.246321 -0.229800 -0.005298 -0.083647 -0.087808 -0.101231 -0.088702 -0.082153 0.086314 0.101292 0.100656 0.104970 0.126184
charge: -0.135643 0.543174 -1.395511 0.408038 0.386551 0.394695 -0.288383 0.048773 0.075566 0.083533 0.079540 0.068522 -0.054143 -0.056447 -0.054295 -0.055529 -0.048439
qa: -0.5767 0.5478 0.6695 -0.2351 -0.2463 -0.2298 -0.0053 -0.0836 -0.0878 -0.1012 -0.0887 -0.0822 0.0863 0.1013 0.1007 0.1050 0.1262
va: 1.8488 3.6360 4.0622 1.0731 1.0455 1.0693 3.6965 3.7624 3.8025 3.8559 3.7842 3.7402 1.0079 0.9846 0.9848 0.9850 1.0081
total: -1042.155591395 hartree
dispersion: -0.014365564 hartree
energy: -1042.169956958848 hartree
dipole: -17.57021 16.10523 -1.46498 -0.31648 0.25459 -0.06188 -1.40118 2.36385 0.96267
magnitude: 1.75405 au
magnitude: 4.45845 debye
