program: Orca
programVersion: 5.0.4
elementType: F C S C C C C C C F F H H H H H
charge: 2
multiplicity: 1
keywords: SP DSD-BLYP D3BJ def2-QZVPP def2-QZVPP/C def2/J TightSCF
formula: C7H5F3S
InChI: InChI=1/C7H5F3S/c8-7(9,10)11-6-4-2-1-3-5-6/h1-5H
16 atoms
F  1.896233 0.95841 -1.064032
C  2.020411 0.259725 0.016923
S  0.588928 -1.115951 -0.020013
C  -0.878202 -0.391045 -0.014935
C  -1.155133 1.042329 0.013896
C  -2.442056 1.45394 0.019192
C  -3.506264 0.494102 -0.006031
C  -3.274687 -0.904078 -0.038197
C  -1.998876 -1.356791 -0.043178
F  1.846542 0.955225 1.093724
F  3.080035 -0.467955 0.039996
H  -0.355967 1.769521 0.031492
H  -2.683635 2.509395 0.042036
H  -4.530436 0.857288 -0.00111
H  -4.110519 -1.592223 -0.058473
H  -1.781167 -2.420121 -0.067235
totalener: -965.12932938 hartree
nucrepener: 706.95083192 hartree
electener: -1672.08016131 hartree
oneelecener: -2701.95872764 hartree
twoeener: 1029.87856634 hartree
kineticenergy: 963.58326332 hartree
exchangeener: -28.832816395124 hartree
correlationener: -1.739534214250 hartree
xcener: -30.572350609374 hartree
chargesum: 2.0000000
charge: -0.132146 0.681785 0.399422 0.151320 0.043140 -0.029015 0.171160 -0.039400 0.045399 -0.134311 -0.095596 0.165348 0.188311 0.217035 0.190215 0.177334
charge: 0.497080 -1.420964 1.113453 -0.281169 0.180592 0.193119 0.359831 0.176927 0.197998 0.495623 0.522939 -0.022721 -0.007491 0.011764 -0.007928 -0.009052
qa: -0.1321 0.6818 0.3994 0.1513 0.0431 -0.0290 0.1712 -0.0394 0.0454 -0.1343 -0.0956 0.1653 0.1883 0.2170 0.1902 0.1773
va: 1.2072 4.3379 2.8605 3.7676 3.7172 3.7799 3.5696 3.8092 3.7093 1.2026 1.2538 0.9758 0.9644 0.9419 0.9648 0.9703
total: -966.167854346 hartree
dispersion: -0.012815544 hartree
energy: -966.180669890493 hartree
dipole: -18.96798 14.37852 -4.58946 -0.25284 -0.12224 -0.37508 -0.11398 0.08032 -0.03366
magnitude: 4.60489 au
magnitude: 11.70469 debye
