program: Orca
programVersion: 5.0.4
elementType: N S N O H H H H
charge: 0
multiplicity: 1
keywords: Freq RIJCOSX PBEh-3c
frequency: 0.00 0.00 0.00 0.00 0.00 0.00 198.16 295.64 356.21 456.64 478.09 551.82 629.01 797.60 845.32 1042.81 1103.68 1249.74 1632.13 1643.98 3578.10 3580.07 3711.97 3714.87
frequency: 198.16 295.64 356.21 456.64 478.09 551.82 629.01 797.60 845.32 1042.81 1103.68 1249.74 1632.13 1643.98 3578.10 3580.07 3711.97 3714.87
formula: H4N2OS
InChI: InChI=1/H4N2OS/c1-4(2)3/h1-2H2
8 atoms
N  -1.297632 -0.422749 -0.141945
S  -0.035515 0.44667 -0.858091
N  1.36561 0.107109 0.025672
O  -0.33806 1.844832 -0.51015
H  -1.235067 -1.426575 -0.24096
H  -1.518353 -0.137229 0.805228
H  1.344845 0.424665 0.987863
H  1.714272 -0.836624 -0.067517
totalener: -584.42464586 hartree
nucrepener: 190.62058894 hartree
electener: -775.04523480 hartree
oneelecener: -1182.90705661 hartree
twoeener: 407.86182181 hartree
kineticenergy: 582.60149267 hartree
exchangeener: -26.871470918641 hartree
correlationener: -1.992199279232 hartree
xcener: -28.863670197873 hartree
energy: -2441.9076 -529.2615 -398.6305 -398.6250 -227.3910 -170.0280 -169.9836 -169.7822 -31.3130 -27.3027 -26.4858 -19.8513 -16.3046 -16.0817 -15.5787 -13.5861 -11.7840 -10.4116 -9.4089 -8.5481 -7.9698 2.3796 2.5215 3.2076 4.4054 4.7783 5.4077 5.4624 11.2496 15.5212 16.9862 18.3541 18.4066 19.4512 20.1681 20.9582 21.1166 22.9378 24.4955 25.4745 26.7180 27.0718 27.6633 27.9420 28.3652 28.5817 30.3626 31.1843 33.4660 36.3578 39.1326 39.3160 46.9312 47.6835 48.2493 51.5581 52.7147 53.4500 55.8861 58.4601 58.7179 58.7846 62.3900 64.8004 65.8308 66.2177 69.2855 77.2979 517.5724 519.2862 696.5324 electronvolt
chargesum: -0.0000000
charge: -0.877465 1.030252 -0.878769 -0.677982 0.343295 0.358112 0.358450 0.344108
charge: -0.620745 0.929772 -0.621044 -0.620891 0.230941 0.235214 0.235345 0.231408
qa: -0.8775 1.0303 -0.8788 -0.6780 0.3433 0.3581 0.3584 0.3441
va: 2.7153 3.6034 2.7152 1.8106 0.8545 0.8509 0.8507 0.8540
dispersion: -0.003018570 hartree
energy: -584.413865765252 hartree
dipole: 0.53067 -0.19921 0.33146 -3.59270 1.70455 -1.88815 3.08542 -2.21949 0.86593
magnitude: 2.10352 au
magnitude: 5.34673 debye
temp: 298.15 k
press: 1.00 atm
zeropoint: 0.05892672 hartree
thermalvibcorrection: 0.00239649 hartree
thermalrotcorrection: 0.00141627 hartree
thermaltrasncorrection: 0.00141627 hartree
thermaltotal: -584.34971001 hartree
thermalcorr: 0.00522904 hartree
nonthermalcorr: 0.05892672 hartree
totalcorr: 0.06415576 hartree
thermalcorrenthalpy: 0.00094421 hartree
totalenthalpy: -584.34876580 hartree
vibrat: 0.00368059 hartree
rotat: 0.01170084 hartree
transl: 0.01855707 hartree
total: 0.03393850 hartree
totalentropycorr: -0.03393850 hartree
gibbsenthalpy: -584.38270430 hartree
gibbsminuselec: 0.03116146 hartree
