program: Orca
programVersion: 5.0.4
elementType: N S N H H H H
charge: 2
multiplicity: 1
keywords: Freq RIJCOSX PBEh-3c
frequency: 0.00 0.00 0.00 0.00 0.00 0.00 421.96 475.84 628.66 779.90 838.28 985.59 1025.85 1187.93 1207.08 1620.07 1651.57 3332.39 3371.24 3449.50 3460.60
frequency: 421.96 475.84 628.66 779.90 838.28 985.59 1025.85 1187.93 1207.08 1620.07 1651.57 3332.39 3371.24 3449.50 3460.60
formula: H4N2S
InChI: InChI=1/H4N2S/c1-3-2/h1-2H2
7 atoms
N  1.26454 0.019731 -0.336175
S  -0.025791 -0.637907 -0.883953
N  -1.266191 -0.058226 -0.160881
H  1.351309 0.741647 0.398141
H  2.159894 -0.294283 -0.752581
H  -2.189165 -0.431474 -0.447962
H  -1.294598 0.660512 0.58101
totalener: -508.54785453 hartree
nucrepener: 121.97046990 hartree
electener: -630.51832443 hartree
oneelecener: -923.32813709 hartree
twoeener: 292.80981265 hartree
kineticenergy: 507.25068685 hartree
exchangeener: -21.884862749662 hartree
correlationener: -1.529215191049 hartree
xcener: -23.414077940711 hartree
energy: -2456.6262 -414.1500 -414.1486 -242.3438 -184.9212 -184.8695 -184.7500 -44.6935 -41.5612 -34.9988 -31.3301 -31.0046 -29.0018 -27.2591 -26.2063 -23.5729 -16.1636 -11.8364 -10.9836 -8.4619 -7.4385 -6.9646 -5.6272 -3.5555 0.7528 2.7792 3.4977 4.5908 4.9547 5.8149 7.2942 8.1936 8.5678 9.9732 12.0648 13.1630 13.2818 14.2812 14.4305 18.8172 19.4781 19.9982 23.4865 26.6639 31.5346 31.5405 38.4813 38.6524 45.3767 45.8539 50.4425 50.8758 53.8917 55.4176 501.3046 502.6852 electronvolt
chargesum: 2.0000000
charge: -0.730043 1.281947 -0.729894 0.536338 0.552677 0.552674 0.536302
charge: -0.326532 1.195171 -0.326415 0.356258 0.372650 0.372648 0.356218
qa: -0.7300 1.2819 -0.7299 0.5363 0.5527 0.5527 0.5363
va: 3.0746 3.0906 3.0748 0.7047 0.6849 0.6849 0.7047
dispersion: -0.002207388 hartree
energy: -508.540055120103 hartree
dipole: 0.07439 -0.04867 0.02572 1.83601 -1.19851 0.63750 1.88481 -1.23109 0.65372
magnitude: 0.91346 au
magnitude: 2.32184 debye
temp: 298.15 k
press: 1.00 atm
zeropoint: 0.05567038 hartree
thermalvibcorrection: 0.00094031 hartree
thermalrotcorrection: 0.00141627 hartree
thermaltrasncorrection: 0.00141627 hartree
thermaltotal: -508.48061188 hartree
thermalcorr: 0.00377286 hartree
nonthermalcorr: 0.05567038 hartree
totalcorr: 0.05944324 hartree
thermalcorrenthalpy: 0.00094421 hartree
totalenthalpy: -508.47966767 hartree
vibrat: 0.00128107 hartree
rotat: 0.01077846 hartree
transl: 0.01824152 hartree
total: 0.03030105 hartree
totalentropycorr: -0.03030105 hartree
gibbsenthalpy: -508.50996872 hartree
gibbsminuselec: 0.03008640 hartree
