program: Orca
programVersion: 5.0.4
elementType: N S F F N C H H H H H H
charge: 0
multiplicity: 1
keywords: Opt RIJCOSX PBEh-3c
formula: CH6F2N2S
InChI: InChI=1/CH6F2N2S/c1-5-6(2,3)4/h5H,4H2,1H3
12 atoms
N  -1.538757 -0.731176 0.153125
S  -0.914835 0.823623 0.343358
F  -0.235249 0.280509 1.8071
F  -1.554408 1.169554 -1.230893
N  0.615877 0.855634 -0.33766
C  1.587528 -0.182873 -0.037028
H  -2.330373 -0.737726 -0.472003
H  -1.726315 -1.174393 1.039658
H  0.503111 1.013871 -1.327857
H  2.392768 -0.067296 -0.760304
H  2.01159 -0.054021 0.95359
H  1.189063 -1.195605 -0.130986
totalener: -747.90807770 hartree
nucrepener: 373.96995726 hartree
electener: -1121.87803496 hartree
oneelecener: -1776.64940071 hartree
twoeener: 654.77136575 hartree
kineticenergy: 745.01115020 hartree
exchangeener: -36.830650508568 hartree
correlationener: -2.826214620967 hartree
xcener: -39.656865129534 hartree
dispersion: -0.005323577 hartree
energy: -2443.0853 -681.7278 -681.3778 -398.9332 -398.9274 -284.7843 -228.3233 -171.0089 -170.8787 -170.6781 -35.0116 -34.2816 -28.4984 -27.1888 -22.3392 -19.9111 -16.8956 -16.2906 -15.5307 -15.2649 -14.3588 -13.1810 -12.2868 -12.2257 -12.0224 -11.8644 -11.8021 -10.4601 -8.9601 -8.3083 1.9102 2.7797 3.1441 4.1634 4.6962 5.0809 5.4026 6.1365 6.4944 6.6199 11.8979 13.6631 14.1334 14.5952 15.2940 16.1454 17.1828 17.6531 19.0927 20.1271 21.8284 22.1026 23.5436 25.6326 25.7397 26.7962 27.1843 27.2239 28.0508 28.1382 28.3717 29.1376 29.3224 30.3418 31.3106 34.1122 34.6618 35.0869 35.5355 35.7207 36.0837 36.1539 36.6008 37.1317 37.5237 38.8676 40.8897 41.6705 42.4294 44.6165 45.4115 45.9653 47.3054 48.4501 49.6976 52.1703 53.6504 55.3799 57.1084 58.8255 62.8598 64.1209 64.7787 66.3285 66.9872 67.6093 68.9646 72.1214 74.4997 78.7962 374.2615 518.8822 524.8778 888.1002 889.8324 electronvolt
chargesum: -0.0000000
charge: -0.867590 1.295819 -0.512070 -0.542119 -0.696277 -0.496806 0.373975 0.370683 0.377230 0.220274 0.249358 0.227523
charge: -0.578382 1.120628 -0.458953 -0.495036 -0.432505 -0.281933 0.246438 0.245299 0.251172 0.129335 0.134908 0.119029
qa: -0.8676 1.2958 -0.5121 -0.5421 -0.6963 -0.4968 0.3740 0.3707 0.3772 0.2203 0.2494 0.2275
va: 2.7639 3.3976 0.8188 0.7790 2.8492 3.7193 0.8458 0.8467 0.8401 0.9124 0.9033 0.9067
dispersion: -0.005323490 hartree
energy: -747.877694590546 hartree
dipole: 5.37745 -5.46015 -0.08269 -5.10398 4.33191 -0.77207 -1.78927 1.57081 -0.21845
magnitude: 0.80663 au
magnitude: 2.05029 debye
