program: Orca
programVersion: 5.0.4
elementType: N S N C H H H H H H
charge: 2
multiplicity: 1
keywords: Opt RIJCOSX PBEh-3c
formula: CH6N2S
InChI: InChI=1/CH6N2S/c1-3-4-2/h3H,2H2,1H3
10 atoms
N  1.799498 -0.105047 -0.348341
S  0.872095 -1.283804 0.069922
N  -0.597055 -0.78234 0.117331
C  -1.172872 0.55158 -0.157493
H  1.524397 0.861582 -0.56531
H  2.808973 -0.306389 -0.417396
H  -1.252527 -1.533396 0.389915
H  -2.247881 0.476671 -0.011753
H  -0.764652 1.283338 0.545547
H  -0.969977 0.837905 -1.193521
totalener: -547.80746054 hartree
nucrepener: 183.73663455 hartree
electener: -731.54409509 hartree
oneelecener: -1096.35186320 hartree
twoeener: 364.80776811 hartree
kineticenergy: 546.18467783 hartree
exchangeener: -25.167539321698 hartree
correlationener: -1.867886277187 hartree
xcener: -27.035425598885 hartree
dispersion: -0.003863466 hartree
dispersion: -0.003864093 hartree
dispersion: -0.003870279 hartree
dispersion: -0.003878620 hartree
dispersion: -0.003889559 hartree
dispersion: -0.003902877 hartree
dispersion: -0.003910994 hartree
dispersion: -0.003924922 hartree
dispersion: -0.003922355 hartree
dispersion: -0.003916474 hartree
dispersion: -0.003919232 hartree
dispersion: -0.003917712 hartree
dispersion: -0.003916689 hartree
energy: -2455.5162 -413.8113 -413.1736 -296.1898 -241.2619 -183.8427 -183.7747 -183.6782 -43.8974 -40.8958 -35.1220 -32.4308 -30.4797 -28.6168 -27.6597 -26.8419 -25.0237 -24.3427 -23.4256 -21.9304 -15.3024 -11.2009 -10.1345 -7.6861 -7.0102 -6.3938 -5.0437 -4.6374 -4.1879 -3.5957 -2.4769 1.0056 3.2910 3.5706 3.6507 4.5874 4.6172 5.5026 7.2398 8.0838 9.3764 9.9204 10.7913 12.5587 13.0764 14.5351 15.0439 15.3791 16.6984 17.0838 18.2018 19.1150 20.0398 21.6578 21.9012 25.8912 28.4892 30.3938 32.4094 37.4745 39.2747 40.8635 43.3625 46.2266 46.2355 47.1665 52.2028 52.5656 53.2747 55.4049 57.5891 61.1764 361.7205 502.7457 505.6015 electronvolt
chargesum: 2.0000000
charge: -0.762812 1.225716 -0.596013 -0.563639 0.525304 0.541215 0.534735 0.392148 0.351965 0.351380
charge: -0.359864 1.137107 -0.213371 -0.255645 0.343321 0.362517 0.358671 0.223297 0.202125 0.201842
qa: -0.7628 1.2257 -0.5960 -0.5636 0.5253 0.5412 0.5347 0.3921 0.3520 0.3514
va: 3.0447 3.0727 3.1706 3.3450 0.7165 0.6967 0.6951 0.8354 0.8475 0.8479
dispersion: -0.003915959 hartree
energy: -547.796062490129 hartree
dipole: -3.00505 3.22752 0.22247 4.80728 -4.34742 0.45986 -0.88047 0.73500 -0.14547
magnitude: 0.53115 au
magnitude: 1.35008 debye
