program: Orca
programVersion: 5.0.4
elementType: N S N C H H H H H H
charge: 2
multiplicity: 1
keywords: SP DSD-BLYP D3BJ def2-QZVPP def2-QZVPP/C def2/J TightSCF
formula: CH6N2S
InChI: InChI=1/CH6N2S/c1-3-4-2/h3H,2H2,1H3
10 atoms
N  1.417986 0.47518 -0.295258
S  0.490583 -0.703576 0.123005
N  -0.978568 -0.202113 0.170413
C  -1.554384 1.131808 -0.10441
H  1.142885 1.44181 -0.512228
H  2.42746 0.273838 -0.364313
H  -1.634039 -0.953168 0.442998
H  -2.629393 1.056898 0.04133
H  -1.146165 1.863566 0.59863
H  -1.35149 1.418133 -1.140438
totalener: -547.90960791 hartree
nucrepener: 184.38545545 hartree
electener: -732.29506336 hartree
oneelecener: -1098.17653209 hartree
twoeener: 365.88146873 hartree
kineticenergy: 547.07737212 hartree
exchangeener: -13.976427192845 hartree
correlationener: -0.792181030912 hartree
xcener: -14.768608223757 hartree
chargesum: 2.0000000
charge: -0.185628 0.928802 -0.140490 0.023204 0.306344 0.318853 0.309157 0.168424 0.136413 0.134922
charge: 0.579650 1.049237 0.408790 0.274415 -0.092642 -0.077277 -0.077423 -0.012213 -0.026225 -0.026312
qa: -0.1856 0.9288 -0.1405 0.0232 0.3063 0.3189 0.3092 0.1684 0.1364 0.1349
va: 3.4541 3.3516 3.4688 3.6944 0.9512 0.9341 0.9418 0.9830 0.9799 0.9798
total: -548.313375922 hartree
dispersion: -0.004766404 hartree
energy: -548.318142325419 hartree
dipole: -3.00505 3.25561 0.25056 4.80728 -4.39797 0.40931 -0.88047 0.74445 -0.13603
magnitude: 0.49882 au
magnitude: 1.26789 debye
