program: Orca
programVersion: 5.0.4
elementType: C N S F F N C H H H H H H H H
charge: 0
multiplicity: 1
keywords: Freq RIJCOSX PBEh-3c
frequency: 0.00 0.00 0.00 0.00 0.00 0.00 76.47 114.05 174.09 220.57 256.93 285.67 323.86 374.75 420.14 451.49 521.46 546.79 642.70 656.31 725.66 848.25 871.51 1128.19 1138.96 1179.98 1184.77 1211.97 1215.98 1459.64 1482.97 1512.02 1521.46 1550.90 1552.43 1574.99 1576.39 3106.16 3116.49 3193.54 3199.98 3242.22 3246.56 3679.55 3680.89
frequency: 76.47 114.05 174.09 220.57 256.93 285.67 323.86 374.75 420.14 451.49 521.46 546.79 642.70 656.31 725.66 848.25 871.51 1128.19 1138.96 1179.98 1184.77 1211.97 1215.98 1459.64 1482.97 1512.02 1521.46 1550.90 1552.43 1574.99 1576.39 3106.16 3116.49 3193.54 3199.98 3242.22 3246.56 3679.55 3680.89
formula: C2H8F2N2S
InChI: InChI=1/C2H8F2N2S/c1-5-7(3,4)6-2/h5-6H,1-2H3
15 atoms
C  -2.077628 -0.699739 0.153346
N  -1.090756 0.210612 -0.40633
S  -0.061891 1.086084 0.617568
F  -0.155406 2.370293 -0.558462
F  0.072771 -0.285322 1.606281
N  1.514722 0.843929 0.102288
C  2.037571 -0.496387 -0.098615
H  -1.621254 -1.631251 0.471555
H  -2.653989 -0.289876 0.987302
H  -2.77575 -0.930403 -0.649412
H  -1.4850 0.866108 -1.063908
H  1.68088 1.460014 -0.678807
H  1.37707 -1.141954 -0.681792
H  2.267554 -0.979432 0.846018
H  2.971105 -0.382676 -0.646934
totalener: -787.12972332 hartree
nucrepener: 464.99280762 hartree
electener: -1252.12253094 hartree
oneelecener: -2010.37855613 hartree
twoeener: 758.25602520 hartree
kineticenergy: 783.88665879 hartree
exchangeener: -40.109230621008 hartree
correlationener: -3.165739186915 hartree
xcener: -43.274969807923 hartree
energy: -2442.9886 -681.7761 -681.3086 -398.9805 -398.9109 -284.9342 -284.7762 -228.2298 -170.9172 -170.7787 -170.5885 -35.0293 -34.2097 -28.5436 -27.4674 -22.8260 -20.9588 -19.4990 -16.5353 -16.3893 -15.3691 -14.8982 -14.2832 -13.4594 -13.1773 -12.4930 -12.2060 -12.0521 -11.9749 -11.7093 -11.6827 -10.0517 -8.6033 -8.0756 1.8096 2.6733 3.2303 4.0969 4.3197 4.9782 5.3459 5.8388 6.3205 6.3869 6.5166 6.5672 6.6827 11.7406 13.1540 13.5096 13.9119 14.3695 14.8482 15.4752 15.8504 16.7200 17.5035 19.4938 20.0856 21.5297 22.3538 22.6282 24.5114 25.8494 26.5654 26.6601 26.8352 27.2059 27.8527 28.0883 28.3412 28.5676 28.8687 29.4227 29.9159 30.2782 30.9767 32.6722 34.6561 35.3232 35.5379 35.7589 36.2829 36.5236 36.7526 37.4873 37.6343 38.9486 39.9115 41.1557 42.0304 43.1032 44.2649 44.8766 46.1900 46.8498 47.7304 48.9582 50.1706 52.2972 54.7890 55.7055 56.6780 57.1457 57.7475 59.6365 63.6195 63.9430 64.6151 65.8505 67.1098 67.2968 68.3222 69.4672 70.4314 74.3950 74.9539 79.3098 373.7347 374.4645 520.8115 525.5235 888.0869 890.2952 electronvolt
chargesum: 0.0000000
charge: -0.493244 -0.710371 1.303157 -0.545021 -0.495635 -0.694787 -0.495053 0.248526 0.216555 0.220410 0.375399 0.377321 0.225863 0.248073 0.218806
charge: -0.281085 -0.448875 1.126175 -0.499045 -0.442123 -0.430612 -0.281637 0.134221 0.113169 0.128582 0.249116 0.251040 0.118407 0.134067 0.128600
qa: -0.4932 -0.7104 1.3032 -0.5450 -0.4956 -0.6948 -0.4951 0.2485 0.2166 0.2204 0.3754 0.3773 0.2259 0.2481 0.2188
va: 3.7327 2.8441 3.3737 0.7810 0.8455 2.8546 3.7239 0.9030 0.9055 0.9113 0.8411 0.8408 0.9071 0.9032 0.9127
dispersion: -0.007133484 hartree
energy: -787.094795992249 hartree
dipole: -0.21584 -0.04681 -0.26265 -7.90697 7.35972 -0.54725 -3.81999 3.15235 -0.66764
magnitude: 0.90233 au
magnitude: 2.29355 debye
temp: 298.15 k
press: 1.00 atm
zeropoint: 0.12135061 hartree
thermalvibcorrection: 0.00585963 hartree
thermalrotcorrection: 0.00141627 hartree
thermaltrasncorrection: 0.00141627 hartree
thermaltotal: -786.96475321 hartree
thermalcorr: 0.00869217 hartree
nonthermalcorr: 0.12135061 hartree
totalcorr: 0.13004278 hartree
thermalcorrenthalpy: 0.00094421 hartree
totalenthalpy: -786.96380900 hartree
vibrat: 0.00988696 hartree
rotat: 0.01335141 hartree
transl: 0.01924452 hartree
total: 0.04248289 hartree
totalentropycorr: -0.04248289 hartree
gibbsenthalpy: -787.00629189 hartree
gibbsminuselec: 0.08850410 hartree
