program: Orca
programVersion: 5.0.4
elementType: C N S F F N C H H H H H H H H
charge: 0
multiplicity: 1
keywords: SP DSD-BLYP D3BJ def2-QZVPP def2-QZVPP/C def2/J TightSCF
formula: C2H8F2N2S
InChI: InChI=1/C2H8F2N2S/c1-5-7(3,4)6-2/h5-6H,1-2H3
15 atoms
C  -2.090393 -1.251269 -0.1131
N  -1.103521 -0.340918 -0.672776
S  -0.074656 0.534554 0.351121
F  -0.168171 1.818763 -0.824908
F  0.060006 -0.836852 1.339834
N  1.501957 0.292399 -0.164159
C  2.024806 -1.047917 -0.365061
H  -1.634019 -2.182781 0.205108
H  -2.666754 -0.841406 0.720855
H  -2.788515 -1.481933 -0.915859
H  -1.497765 0.314578 -1.330355
H  1.668115 0.908484 -0.945254
H  1.364305 -1.693484 -0.948238
H  2.254789 -1.530962 0.579571
H  2.95834 -0.934207 -0.913381
totalener: -787.20067191 hartree
nucrepener: 464.99280797 hartree
electener: -1252.19347988 hartree
oneelecener: -2010.41853932 hartree
twoeener: 758.22505944 hartree
kineticenergy: 785.95608787 hartree
exchangeener: -22.279582902398 hartree
correlationener: -1.343529760634 hartree
xcener: -23.623112663032 hartree
chargesum: -0.0000000
charge: -0.015260 -0.436752 1.090234 -0.533984 -0.488846 -0.430195 -0.020361 0.097256 0.065374 0.059201 0.185140 0.197257 0.073234 0.099346 0.058356
charge: 0.088582 0.314877 0.291425 -0.143243 -0.062650 0.314831 0.093131 -0.071619 -0.074804 -0.065606 -0.238340 -0.233876 -0.075913 -0.071096 -0.065701
qa: -0.0153 -0.4368 1.0902 -0.5340 -0.4888 -0.4302 -0.0204 0.0973 0.0654 0.0592 0.1851 0.1973 0.0732 0.0993 0.0584
va: 3.8764 2.8905 3.5238 0.6705 0.7244 2.9473 3.8720 0.9928 0.9891 0.9857 1.0297 1.0182 0.9952 0.9917 0.9845
total: -787.992619349 hartree
dispersion: -0.008270914 hartree
energy: -788.000890263079 hartree
dipole: -0.21584 -0.00958 -0.22542 -7.90697 7.25960 -0.64737 -3.81999 3.16713 -0.65286
magnitude: 0.94664 au
magnitude: 2.40617 debye
