program: Orca
programVersion: 5.0.4
elementType: C N S N C O H H H H H H H H
charge: 0
multiplicity: 1
keywords: Opt RIJCOSX PBEh-3c
formula: C2H8N2OS
InChI: InChI=1/C2H8N2OS/c1-3-6(5)4-2/h3-4H,1-2H3
14 atoms
C  2.043807 0.181993 -0.020493
N  1.127172 -0.885678 0.316554
S  -0.106822 -1.212693 -0.779664
N  -0.887724 0.304908 -0.821149
C  -1.729358 0.647379 0.312925
O  -0.967857 -2.18589 -0.07693
H  1.607702 1.183165 0.031792
H  2.902984 0.13209 0.646746
H  2.415021 0.032274 -1.034578
H  0.787216 -0.878789 1.272054
H  -1.375733 0.39684 -1.703611
H  -1.123781 0.707879 1.217111
H  -2.151704 1.63658 0.145377
H  -2.541022 -0.060159 0.493867
totalener: -662.88141054 hartree
nucrepener: 344.42216199 hartree
electener: -1007.30357253 hartree
oneelecener: -1593.90270867 hartree
twoeener: 586.59913613 hartree
kineticenergy: 660.35536754 hartree
exchangeener: -33.433544629151 hartree
correlationener: -2.673117707509 hartree
xcener: -36.106662336660 hartree
dispersion: -0.006774168 hartree
dispersion: -0.006773836 hartree
dispersion: -0.006772635 hartree
energy: -2441.6526 -529.2383 -398.7191 -398.6495 -284.8790 -284.8662 -227.1408 -169.7604 -169.7426 -169.5412 -31.2011 -27.7460 -27.0976 -21.8055 -20.8961 -18.8434 -16.1455 -15.1591 -14.7412 -13.9021 -13.5924 -13.0793 -12.2549 -12.1552 -11.5525 -9.6901 -8.6864 -8.2466 -7.7983 2.1679 2.7151 3.1936 4.0890 4.6525 4.9331 5.5744 5.9903 6.0655 6.1243 6.2351 6.6605 7.0616 11.2098 13.2045 13.6500 14.2044 14.9511 15.4346 15.8661 16.8069 17.8115 18.6965 19.5788 21.7158 22.2196 22.8319 23.4087 24.6423 25.5256 26.1470 26.8633 26.9616 27.3531 27.9776 28.2519 28.6650 29.1765 29.3380 30.0075 30.0641 31.4923 31.6434 32.7379 33.7493 35.5117 36.9027 41.0719 41.6615 43.6814 44.6890 45.8726 47.9757 51.8518 52.4869 53.3701 54.4747 55.3295 55.6665 56.3900 57.0333 57.3626 59.4794 61.1476 62.9946 63.5356 64.9950 65.6279 66.3197 67.4842 67.7598 69.2667 73.3292 74.2122 77.5834 373.3137 374.2211 521.4262 521.7636 697.4834 electronvolt
chargesum: 0.0000000
charge: -0.496470 -0.703898 1.016041 -0.716770 -0.504390 -0.680594 0.219279 0.232406 0.230579 0.360288 0.355685 0.214968 0.231483 0.241394
charge: -0.284793 -0.465772 0.923854 -0.485849 -0.289598 -0.625126 0.111949 0.130471 0.130070 0.239644 0.239403 0.120988 0.131216 0.123543
qa: -0.4965 -0.7039 1.0160 -0.7168 -0.5044 -0.6806 0.2193 0.2324 0.2306 0.3603 0.3557 0.2150 0.2315 0.2414
va: 3.7159 2.8138 3.5679 2.7955 3.7254 1.8289 0.9046 0.9072 0.9103 0.8444 0.8365 0.9162 0.9104 0.9001
dispersion: -0.006772917 hartree
energy: -662.861501575128 hartree
dipole: 1.25919 -1.07134 0.18785 7.73033 -6.29118 1.43914 3.01241 -3.07640 -0.06399
magnitude: 1.45276 au
magnitude: 3.69263 debye
