program: Orca
programVersion: 5.0.4
elementType: C N S N C C H H H H H H H H H H
charge: 2
multiplicity: 1
keywords: SP DSD-BLYP D3BJ def2-QZVPP def2-QZVPP/C def2/J TightSCF
formula: C3H10N2S
InChI: InChI=1/C3H10N2S/c1-4-6-5(2)3/h4H,1-3H3
16 atoms
C  2.791493 0.48407 -0.118787
N  1.314567 0.613377 -0.269849
S  0.351569 -0.487534 0.285753
N  -1.142208 -0.122252 0.005987
C  -1.60489 1.091463 -0.684181
C  -2.155136 -1.101225 0.495257
H  3.226123 0.478887 -1.117632
H  3.05123 -0.433141 0.406183
H  3.141898 1.348549 0.443936
H  0.975356 1.453587 -0.747276
H  -1.20098 1.129917 -1.699382
H  -1.32371 1.981478 -0.114578
H  -2.689469 1.04994 -0.746916
H  -1.687829 -1.952767 0.989491
H  -2.725085 -1.444001 -0.368615
H  -2.805821 -0.579583 1.197722
totalener: -626.31970885 hartree
nucrepener: 330.67373346 hartree
electener: -956.99344230 hartree
oneelecener: -1490.29828400 hartree
twoeener: 533.30484169 hartree
kineticenergy: 625.28258763 hartree
exchangeener: -17.639695988649 hartree
correlationener: -1.070621785246 hartree
xcener: -18.710317773895 hartree
chargesum: 2.0000000
charge: 0.013235 -0.220949 0.825536 -0.142665 0.000411 -0.010452 0.160591 0.111624 0.157479 0.272763 0.117086 0.124040 0.160573 0.123333 0.153831 0.153564
charge: 0.261246 0.391603 0.999088 0.212774 0.243381 0.252148 -0.026397 -0.038260 -0.026283 -0.118231 -0.030886 -0.029569 -0.014647 -0.035027 -0.020611 -0.020330
qa: 0.0132 -0.2209 0.8255 -0.1427 0.0004 -0.0105 0.1606 0.1116 0.1575 0.2728 0.1171 0.1240 0.1606 0.1233 0.1538 0.1536
va: 3.6989 3.3989 3.3408 3.3942 3.7374 3.7229 0.9769 0.9911 0.9781 0.9690 0.9849 0.9859 0.9860 0.9875 0.9741 0.9742
total: -626.909356114 hartree
dispersion: -0.008621729 hartree
energy: -626.917977843178 hartree
dipole: -1.92131 1.93062 0.00931 2.86192 -2.39276 0.46916 -1.65801 1.40562 -0.25239
magnitude: 0.53282 au
magnitude: 1.35433 debye
