program: Orca
programVersion: 5.0.4
elementType: C N C S F N C C H H H H H H H H H H H H
charge: 1
multiplicity: 1
keywords: Freq RIJCOSX PBEh-3c
frequency: 0.00 0.00 0.00 0.00 0.00 0.00 70.44 89.48 109.55 149.57 164.62 210.21 220.06 237.15 276.38 321.47 352.25 363.50 406.25 444.95 541.30 734.79 768.67 808.86 1017.15 1035.23 1101.00 1103.98 1145.98 1151.06 1188.51 1191.61 1235.13 1279.16 1343.37 1350.79 1495.86 1505.35 1522.63 1525.79 1529.23 1533.73 1539.39 1544.13 1549.23 1557.66 1566.30 1569.50 3128.58 3130.97 3132.82 3138.51 3221.81 3225.69 3227.66 3229.43 3238.31 3242.22 3248.54 3263.36
frequency: 70.44 89.48 109.55 149.57 164.62 210.21 220.06 237.15 276.38 321.47 352.25 363.50 406.25 444.95 541.30 734.79 768.67 808.86 1017.15 1035.23 1101.00 1103.98 1145.98 1151.06 1188.51 1191.61 1235.13 1279.16 1343.37 1350.79 1495.86 1505.35 1522.63 1525.79 1529.23 1533.73 1539.39 1544.13 1549.23 1557.66 1566.30 1569.50 3128.58 3130.97 3132.82 3138.51 3221.81 3225.69 3227.66 3229.43 3238.31 3242.22 3248.54 3263.36
formula: C4H12FN2S
InChI: InChI=1/C4H12FN2S/c1-6(2)8(5)7(3)4/h1-4H3
20 atoms
C  -2.46213 0.868211 0.883906
N  -1.310669 0.295431 0.173501
C  -1.555371 -0.892756 -0.637547
S  0.114864 0.746853 0.743914
F  0.353257 -0.193737 2.045495
N  1.229916 0.193609 -0.267948
C  1.647637 -1.212898 -0.313127
C  2.275642 1.163059 -0.634379
H  -2.184161 1.79253 1.389619
H  -3.230162 1.103832 0.151029
H  -2.860769 0.171213 1.619909
H  -0.812734 -0.975603 -1.426737
H  -1.585349 -1.806443 -0.043341
H  -2.523637 -0.759485 -1.114337
H  2.501746 -1.376355 0.343917
H  1.934381 -1.445232 -1.336581
H  0.85337 -1.89164 -0.019305
H  1.911527 2.184605 -0.548843
H  2.541683 0.992422 -1.675023
H  3.161059 1.042484 -0.010322
totalener: -765.67481265 hartree
nucrepener: 545.90320505 hartree
electener: -1311.57801769 hartree
oneelecener: -2120.71722197 hartree
twoeener: 809.13920427 hartree
kineticenergy: 762.30355513 hartree
exchangeener: -40.860807145464 hartree
correlationener: -3.370531513626 hartree
xcener: -44.231338659090 hartree
energy: -2448.3616 -688.2925 -404.9730 -404.9125 -289.6218 -289.5966 -289.5801 -289.5559 -233.7985 -176.4404 -176.3545 -176.1972 -41.5315 -35.3907 -33.4872 -28.5340 -27.0785 -26.7730 -25.2013 -23.2953 -21.5367 -21.1712 -20.6723 -19.4395 -19.3983 -18.8960 -18.6852 -18.4316 -17.8110 -17.2464 -17.1071 -16.8577 -16.8180 -16.4595 -15.9233 -14.1130 -13.2421 -4.7211 -3.3526 -2.3562 -0.8996 -0.2392 0.1460 0.4354 0.8279 1.0885 1.2512 1.4383 1.4971 1.7590 1.8732 2.1219 2.3462 2.5088 2.8762 3.2189 5.5151 7.7096 7.9320 8.5121 8.9573 9.2323 9.3967 10.1394 10.3454 11.0956 12.3657 12.7404 13.0894 13.4382 13.9031 14.8661 15.2601 16.1559 17.6699 18.6893 19.7889 20.4470 21.1515 21.8379 22.5543 23.0386 23.1709 23.2517 23.6525 23.9695 24.0244 24.2279 24.4921 24.9379 25.1657 25.9751 26.2715 26.9278 27.5410 27.6329 28.8053 29.7196 29.9722 30.7948 31.1359 32.5308 32.8340 33.5744 35.3813 35.7891 36.5021 36.9527 37.6116 38.6004 40.7948 42.8321 45.6456 46.9728 47.8101 49.9072 50.3716 50.4971 51.2364 51.7540 52.4043 52.5549 53.1138 53.3743 54.7943 57.2051 57.7718 58.3557 58.6852 60.8500 61.7822 62.8578 63.5210 64.1654 64.9487 67.6335 68.6164 69.9287 70.6799 72.9596 367.7080 367.8895 370.6167 371.3737 516.4870 518.7864 885.4885 electronvolt
chargesum: 1.0000000
charge: -0.516173 -0.546808 -0.526578 1.234127 -0.398087 -0.569087 -0.529405 -0.506541 0.271119 0.287018 0.280546 0.280529 0.270757 0.295448 0.288121 0.284450 0.271363 0.271020 0.286632 0.271549
charge: -0.257700 -0.282702 -0.263981 1.131792 -0.348875 -0.301565 -0.264249 -0.255182 0.152448 0.159144 0.150611 0.153032 0.145985 0.165370 0.152597 0.158320 0.148630 0.151724 0.158778 0.145823
qa: -0.5162 -0.5468 -0.5266 1.2341 -0.3981 -0.5691 -0.5294 -0.5065 0.2711 0.2870 0.2805 0.2805 0.2708 0.2954 0.2881 0.2844 0.2714 0.2710 0.2866 0.2715
va: 3.5679 3.0416 3.5716 3.3762 0.9585 3.0060 3.5784 3.5624 0.8982 0.8860 0.8804 0.8874 0.8868 0.8863 0.8828 0.8858 0.8976 0.8993 0.8847 0.8868
dispersion: -0.010752902 hartree
energy: -765.648155086294 hartree
dipole: -1.18651 1.01000 -0.17650 -2.61755 2.62316 0.00561 -8.14685 7.33211 -0.81474
magnitude: 0.83365 au
magnitude: 2.11898 debye
temp: 298.15 k
press: 1.00 atm
zeropoint: 0.17605493 hartree
thermalvibcorrection: 0.00797468 hartree
thermalrotcorrection: 0.00141627 hartree
thermaltrasncorrection: 0.00141627 hartree
thermaltotal: -765.46129293 hartree
thermalcorr: 0.01080722 hartree
nonthermalcorr: 0.17605493 hartree
totalcorr: 0.18686215 hartree
thermalcorrenthalpy: 0.00094421 hartree
totalenthalpy: -765.46034872 hartree
vibrat: 0.01402801 hartree
rotat: 0.01369688 hartree
transl: 0.01933978 hartree
total: 0.04706467 hartree
totalentropycorr: -0.04706467 hartree
gibbsenthalpy: -765.50741339 hartree
gibbsminuselec: 0.14074169 hartree
