program: Orca
programVersion: 5.0.4
elementType: C N C S F N C C H H H H H H H H H H H H
charge: 1
multiplicity: 1
keywords: SP DSD-BLYP D3BJ def2-QZVPP def2-QZVPP/C def2/J TightSCF
formula: C4H12FN2S
InChI: InChI=1/C4H12FN2S/c1-6(2)8(5)7(3)4/h1-4H3
20 atoms
C  -2.518419 0.686849 0.522742
N  -1.366958 0.11407 -0.187663
C  -1.61166 -1.074118 -0.998711
S  0.058574 0.565492 0.38275
F  0.296968 -0.375098 1.684331
N  1.173627 0.012247 -0.629112
C  1.591348 -1.394259 -0.674291
C  2.219353 0.981698 -0.995542
H  -2.24045 1.611168 1.028456
H  -3.286452 0.92247 -0.210134
H  -2.917059 -0.010149 1.258746
H  -0.869023 -1.156965 -1.787901
H  -1.641638 -1.987805 -0.404504
H  -2.579927 -0.940846 -1.475501
H  2.445457 -1.557717 -0.017247
H  1.878092 -1.626594 -1.697745
H  0.79708 -2.073002 -0.380468
H  1.855237 2.003243 -0.910007
H  2.485394 0.81106 -2.036187
H  3.10477 0.861122 -0.371485
totalener: -765.64505810 hartree
nucrepener: 545.90320489 hartree
electener: -1311.54826298 hartree
oneelecener: -2121.28196834 hartree
twoeener: 809.73370536 hartree
kineticenergy: 764.30827386 hartree
exchangeener: -22.721123751150 hartree
correlationener: -1.418083613711 hartree
xcener: -24.139207364860 hartree
chargesum: 1.0000000
charge: -0.022504 -0.311933 -0.025317 0.880132 -0.327790 -0.329839 -0.007060 -0.017456 0.091552 0.103603 0.104129 0.098795 0.090494 0.110980 0.098659 0.100170 0.082269 0.091350 0.097065 0.092699
charge: 0.162432 0.162550 0.165414 0.562997 0.070703 0.153736 0.161081 0.160191 -0.052295 -0.045520 -0.050267 -0.053457 -0.054265 -0.040184 -0.048130 -0.045343 -0.058102 -0.055458 -0.045219 -0.050863
qa: -0.0225 -0.3119 -0.0253 0.8801 -0.3278 -0.3298 -0.0071 -0.0175 0.0916 0.1036 0.1041 0.0988 0.0905 0.1110 0.0987 0.1002 0.0823 0.0913 0.0971 0.0927
va: 3.8334 3.0519 3.8203 3.6304 0.9616 3.0009 3.8208 3.8313 0.9894 0.9823 0.9888 0.9887 0.9963 0.9842 0.9951 0.9843 0.9895 0.9898 0.9849 0.9910
total: -766.465882600 hartree
dispersion: -0.012214605 hartree
energy: -766.478097205580 hartree
dipole: -1.18651 1.00409 -0.18242 -2.61755 2.66230 0.04475 -8.14685 7.27242 -0.87443
magnitude: 0.89437 au
magnitude: 2.27332 debye
