program: Orca
programVersion: 5.0.4
elementType: C N C S N C C O H H H H H H H H H H H H
charge: 0
multiplicity: 1
keywords: Freq RIJCOSX PBEh-3c
frequency: 0.00 0.00 0.00 0.00 0.00 0.00 66.15 90.69 140.70 193.59 214.73 219.68 230.05 253.33 283.03 342.19 352.01 382.83 441.29 469.28 550.14 682.80 698.72 980.57 996.43 1099.88 1105.48 1154.48 1157.66 1205.71 1209.03 1215.61 1270.72 1285.66 1306.69 1322.52 1488.65 1490.91 1513.63 1517.89 1538.30 1546.74 1550.26 1553.47 1555.25 1562.04 1566.89 1575.11 3058.24 3062.79 3080.83 3097.82 3162.58 3164.06 3164.50 3175.99 3202.03 3217.81 3232.08 3245.58
frequency: 66.15 90.69 140.70 193.59 214.73 219.68 230.05 253.33 283.03 342.19 352.01 382.83 441.29 469.28 550.14 682.80 698.72 980.57 996.43 1099.88 1105.48 1154.48 1157.66 1205.71 1209.03 1215.61 1270.72 1285.66 1306.69 1322.52 1488.65 1490.91 1513.63 1517.89 1538.30 1546.74 1550.26 1553.47 1555.25 1562.04 1566.89 1575.11 3058.24 3062.79 3080.83 3097.82 3162.58 3164.06 3164.50 3175.99 3202.03 3217.81 3232.08 3245.58
formula: C4H12N2OS
InChI: InChI=1/C4H12N2OS/c1-5(2)8(7)6(3)4/h1-4H3
20 atoms
C  1.638034 1.223589 0.445293
N  1.23135 -0.055293 -0.10154
C  2.349809 -0.92186 -0.416923
S  0.006355 -0.81473 0.849932
N  -1.232708 0.196056 0.305507
C  -2.355244 0.244376 1.222859
C  -1.613777 0.057461 -1.087673
O  -0.119831 -2.17539 0.2891
H  2.23909 1.140804 1.360496
H  2.235641 1.750257 -0.299683
H  0.764142 1.837151 0.655961
H  2.947023 -0.434852 -1.188892
H  1.995971 -1.867241 -0.816983
H  3.008976 -1.124132 0.438017
H  -2.94135 1.142385 1.023704
H  -3.021408 -0.621686 1.140932
H  -1.997353 0.30612 2.2507
H  -0.723531 0.022449 -1.710927
H  -2.214474 -0.837547 -1.275313
H  -2.196716 0.932083 -1.378268
totalener: -741.33552088 hartree
nucrepener: 533.37335645 hartree
electener: -1274.70887733 hartree
oneelecener: -2075.24480638 hartree
twoeener: 800.53592905 hartree
kineticenergy: 738.09332973 hartree
exchangeener: -39.991091166604 hartree
correlationener: -3.355834952648 hartree
xcener: -43.346926119252 hartree
energy: -2441.5648 -529.3282 -398.8874 -398.7352 -284.8889 -284.7138 -284.5689 -284.5631 -227.0436 -169.6597 -169.6396 -169.4523 -31.2138 -28.1338 -27.6335 -21.9862 -21.8868 -21.5850 -19.3658 -17.3911 -15.6881 -15.0739 -14.5823 -14.1123 -13.9346 -13.7289 -12.5283 -12.3792 -12.1884 -11.8514 -11.7199 -11.6799 -11.5259 -9.5426 -8.7467 -7.8956 -7.1686 1.9230 2.6086 3.6785 3.9161 4.5595 5.0429 5.2460 5.3799 5.6927 5.8656 5.9730 6.0906 6.3914 6.5537 6.8068 6.9182 7.0795 7.3052 7.5515 11.1419 12.5967 13.1013 13.4339 13.9361 14.3522 14.7638 15.5286 15.7295 16.0219 16.9240 17.9890 18.3370 18.9730 19.2147 20.8160 21.7472 22.5234 23.1770 23.9687 24.6080 25.3435 25.4823 26.0949 26.7954 27.3633 27.6911 27.7976 28.1476 28.3386 28.4401 28.7559 28.9710 29.1039 29.7964 30.6868 30.9217 31.5410 31.8572 32.1991 33.7825 34.5841 35.7857 36.3046 38.4986 39.3868 41.0026 41.2793 41.6380 41.9549 46.2922 46.6855 50.7407 51.3561 52.2970 52.8267 53.1539 55.0475 55.5587 56.0151 56.5349 56.7954 57.0077 57.0817 57.9814 58.6842 58.8343 60.3329 61.6513 61.9770 62.4404 63.1440 63.4953 66.1931 66.3758 68.9896 69.6485 70.1596 70.8772 72.9143 73.5398 75.5417 76.5525 78.4953 372.7413 373.3288 376.1832 376.5932 523.9433 524.4185 698.2531 electronvolt
chargesum: -0.0000000
charge: -0.501460 -0.541011 -0.505152 1.003408 -0.545496 -0.493548 -0.498055 -0.668956 0.200960 0.230263 0.245951 0.225261 0.271534 0.194374 0.230768 0.216412 0.233545 0.257775 0.222780 0.220650
charge: -0.283042 -0.352066 -0.281825 0.932663 -0.348639 -0.276826 -0.278858 -0.611438 0.104818 0.129281 0.134086 0.127349 0.146532 0.102451 0.127884 0.113006 0.129727 0.141567 0.117784 0.125545
qa: -0.5015 -0.5410 -0.5052 1.0034 -0.5455 -0.4935 -0.4981 -0.6690 0.2010 0.2303 0.2460 0.2253 0.2715 0.1944 0.2308 0.2164 0.2335 0.2578 0.2228 0.2207
va: 3.6841 2.8954 3.6869 3.5209 2.9099 3.6871 3.6807 1.8537 0.9108 0.9090 0.9160 0.9090 0.9094 0.9121 0.9072 0.9045 0.9161 0.9146 0.9065 0.9113
dispersion: -0.011053192 hartree
energy: -741.308518768285 hartree
dipole: 0.20458 -0.19861 0.00597 6.18420 -5.01944 1.16476 -2.88052 2.96913 0.08861
magnitude: 1.16814 au
magnitude: 2.96918 debye
temp: 298.15 k
press: 1.00 atm
zeropoint: 0.17597730 hartree
thermalvibcorrection: 0.00760026 hartree
thermalrotcorrection: 0.00141627 hartree
thermaltrasncorrection: 0.00141627 hartree
thermaltotal: -741.12210867 hartree
thermalcorr: 0.01043281 hartree
nonthermalcorr: 0.17597730 hartree
totalcorr: 0.18641010 hartree
thermalcorrenthalpy: 0.00094421 hartree
totalenthalpy: -741.12116446 hartree
vibrat: 0.01310887 hartree
rotat: 0.01365584 hartree
transl: 0.01930894 hartree
total: 0.04607365 hartree
totalentropycorr: -0.04607365 hartree
gibbsenthalpy: -741.16723811 hartree
gibbsminuselec: 0.14128066 hartree
