program: Orca
programVersion: 5.0.4
elementType: C N C S N C C H H H H H H H H H H H H
charge: 2
multiplicity: 1
keywords: Freq RIJCOSX PBEh-3c
frequency: 0.00 0.00 0.00 0.00 0.00 0.00 57.41 134.42 162.40 173.05 191.17 201.91 260.98 312.53 335.02 372.23 380.09 421.01 509.85 707.67 740.63 971.64 983.85 1050.60 1077.52 1103.53 1106.23 1158.66 1162.21 1185.45 1225.55 1312.15 1341.34 1466.68 1470.58 1480.94 1489.82 1498.78 1508.56 1512.16 1512.47 1517.28 1533.34 1538.47 1540.88 3117.26 3118.13 3124.91 3129.67 3220.43 3221.59 3228.15 3228.24 3245.00 3245.69 3282.27 3282.79
frequency: 57.41 134.42 162.40 173.05 191.17 201.91 260.98 312.53 335.02 372.23 380.09 421.01 509.85 707.67 740.63 971.64 983.85 1050.60 1077.52 1103.53 1106.23 1158.66 1162.21 1185.45 1225.55 1312.15 1341.34 1466.68 1470.58 1480.94 1489.82 1498.78 1508.56 1512.16 1512.47 1517.28 1533.34 1538.47 1540.88 3117.26 3118.13 3124.91 3129.67 3220.43 3221.59 3228.15 3228.24 3245.00 3245.69 3282.27 3282.79
formula: C4H12N2S
InChI: InChI=1/C4H12N2S/c1-5(2)7-6(3)4/h1-4H3
19 atoms
C  2.364203 -0.845049 1.254391
N  1.278946 -0.165996 0.482335
C  1.713175 0.666287 -0.654407
S  -0.158057 -0.454685 1.038362
N  -1.352783 -0.055443 0.10526
C  -2.676589 -0.050918 0.801087
C  -1.375931 0.299279 -1.325263
H  2.881993 -1.521748 0.574325
H  3.042559 -0.075785 1.618748
H  1.968251 -1.417661 2.093381
H  1.939101 0.031217 -1.512336
H  2.63066 1.163171 -0.340452
H  0.975589 1.420869 -0.903716
H  -3.076993 0.961641 0.74456
H  -3.328469 -0.749427 0.279566
H  -2.586274 -0.339717 1.84834
H  -0.512373 -0.092312 -1.851311
H  -1.452858 1.381944 -1.435732
H  -2.274249 -0.155668 -1.742039
totalener: -665.55148647 hartree
nucrepener: 419.90828673 hartree
electener: -1085.45977320 hartree
oneelecener: -1717.86670056 hartree
twoeener: 632.40692736 hartree
kineticenergy: 662.90731224 hartree
exchangeener: -35.011353530517 hartree
correlationener: -2.887665922211 hartree
xcener: -37.899019452727 hartree
energy: -2453.1743 -412.0121 -412.0106 -294.8082 -294.8067 -294.6649 -294.6646 -238.9192 -181.5079 -181.4105 -181.3580 -41.9458 -39.6745 -34.2605 -32.3628 -32.2457 -30.8492 -27.8172 -26.3513 -25.7378 -25.6651 -24.5087 -24.3214 -23.4364 -22.4498 -22.3565 -22.0801 -22.0303 -21.9191 -21.6515 -21.4970 -18.9351 -13.3993 -9.0233 -8.9761 -5.7999 -5.2531 -4.8376 -4.6657 -4.1286 -3.7562 -3.5573 -3.4647 -3.1283 -3.0628 -3.0295 -2.6465 -2.5781 -2.2696 -1.3382 -1.3220 -0.3141 2.5188 3.1796 3.7067 4.0048 4.2291 4.9212 5.3366 5.6974 6.0482 6.5292 7.3299 7.5847 7.6681 8.9474 9.3845 10.8367 11.5586 11.7289 14.3088 14.8215 14.8540 15.0577 15.2951 17.9463 17.9868 18.0897 18.5051 19.1319 19.3221 19.3987 19.7610 19.9636 20.2257 20.7558 20.8574 21.7634 22.0705 22.6772 22.9872 23.6784 28.6259 28.6962 29.7119 30.0742 31.0568 32.1026 35.2192 35.8756 40.8512 42.5272 43.8171 43.8254 44.7459 45.0625 46.3700 46.4430 47.5356 47.9192 48.5149 48.8549 51.6725 51.6931 52.6385 53.3318 53.7826 53.9492 56.6106 56.6689 59.3349 59.8795 61.1745 62.6173 64.6359 65.8540 362.0466 362.2790 364.9658 365.9028 508.5192 510.5090 electronvolt
chargesum: 2.0000000
charge: -0.529100 -0.476193 -0.549024 1.055919 -0.476190 -0.529474 -0.549709 0.348927 0.345645 0.318265 0.343998 0.359687 0.310062 0.348598 0.345914 0.318352 0.310247 0.344288 0.359789
charge: -0.233814 -0.160479 -0.248595 1.011698 -0.160767 -0.233773 -0.248857 0.197308 0.193926 0.178946 0.193591 0.202076 0.171380 0.197231 0.193961 0.178894 0.171391 0.193722 0.202161
qa: -0.5291 -0.4762 -0.5490 1.0559 -0.4762 -0.5295 -0.5497 0.3489 0.3456 0.3183 0.3440 0.3597 0.3101 0.3486 0.3459 0.3184 0.3102 0.3443 0.3598
va: 3.3973 3.2254 3.4205 3.0726 3.2251 3.3968 3.4203 0.8485 0.8536 0.8751 0.8521 0.8505 0.8740 0.8488 0.8534 0.8751 0.8741 0.8519 0.8502
dispersion: -0.009677751 hartree
energy: -665.529170986300 hartree
dipole: 0.72140 -0.66598 0.05542 2.09865 -1.93902 0.15962 -4.52303 4.17885 -0.34418
magnitude: 0.38342 au
magnitude: 0.97458 debye
temp: 298.15 k
press: 1.00 atm
zeropoint: 0.17121165 hartree
thermalvibcorrection: 0.00682022 hartree
thermalrotcorrection: 0.00141627 hartree
thermaltrasncorrection: 0.00141627 hartree
thermaltotal: -665.34830657 hartree
thermalcorr: 0.00965277 hartree
nonthermalcorr: 0.17121165 hartree
totalcorr: 0.18086442 hartree
thermalcorrenthalpy: 0.00094421 hartree
totalenthalpy: -665.34736236 hartree
vibrat: 0.01180395 hartree
rotat: 0.01343403 hartree
transl: 0.01913198 hartree
total: 0.04436996 hartree
totalentropycorr: -0.04436996 hartree
gibbsenthalpy: -665.39173232 hartree
gibbsminuselec: 0.13743866 hartree
