program: Orca
programVersion: 5.0.4
elementType: N C C C C S F F N C C C C H H H H H H H H H H H H H H H H H H H H
charge: 0
multiplicity: 1
keywords: Opt RIJCOSX PBEh-3c
formula: C8H20F2N2S
InChI: InChI=1/C8H20F2N2S/c1-7(2,3)11-13(9,10)12-8(4,5)6/h11-12H,1-6H3
33 atoms
N  -1.239424 -0.215491 -0.597432
C  -2.64755 -0.032703 -0.174877
C  -2.980732 1.426749 0.144966
C  -3.465677 -0.49357 -1.381189
C  -2.980967 -0.916592 1.022522
S  -0.019024 0.216482 0.487341
F  0.088792 1.800764 -0.218268
F  -0.119597 -1.369085 1.194494
N  1.284567 -0.269347 -0.47055
C  2.653247 -0.026491 0.041649
C  3.564425 -0.633321 -1.025208
C  2.908027 -0.711471 1.386765
C  2.940289 1.46759 0.151045
H  -1.064482 0.340319 -1.430159
H  -2.425268 1.791329 1.009554
H  -2.753837 2.085055 -0.694568
H  -4.04269 1.529322 0.371952
H  -3.24981 -1.533755 -1.623758
H  -3.256609 0.113947 -2.264731
H  -4.531471 -0.404503 -1.170354
H  -2.70981 -1.954278 0.838865
H  -2.478563 -0.594146 1.933793
H  -4.054022 -0.867549 1.210398
H  1.152074 -1.267255 -0.611386
H  3.401714 -0.158486 -1.992479
H  3.393065 -1.706453 -1.138602
H  4.610037 -0.498797 -0.748642
H  2.707957 -1.782118 1.336944
H  3.948103 -0.578739 1.68717
H  2.285679 -0.296213 2.180294
H  3.995881 1.609697 0.384512
H  2.719526 1.981548 -0.782368
H  2.366149 1.947558 0.942207
totalener: -1022.52531325 hartree
nucrepener: 1120.42229731 hartree
electener: -2142.94761056 hartree
oneelecener: -3632.33840037 hartree
twoeener: 1489.39078982 hartree
kineticenergy: 1017.20379732 hartree
exchangeener: -59.795838636980 hartree
correlationener: -5.218066293111 hartree
xcener: -65.013904930091 hartree
dispersion: -0.020790285 hartree
dispersion: -0.020783970 hartree
dispersion: -0.020778683 hartree
dispersion: -0.020783060 hartree
dispersion: -0.020783424 hartree
energy: -2442.8098 -680.9681 -680.9518 -398.9132 -398.9070 -285.6369 -285.6310 -283.9145 -283.9124 -283.7159 -283.7114 -283.6218 -283.6070 -228.0696 -170.7460 -170.5934 -170.4695 -34.2161 -33.6372 -28.8316 -27.7029 -24.7137 -23.6181 -21.4099 -21.2089 -21.0530 -21.0265 -20.5746 -17.6044 -17.2674 -16.4873 -15.2523 -15.0889 -14.5675 -14.4777 -13.8797 -13.7677 -13.3509 -13.2778 -12.7311 -12.4952 -12.3098 -12.1322 -11.9160 -11.7980 -11.6496 -11.5181 -11.3928 -11.3836 -11.3329 -11.0097 -10.8554 -10.7092 -10.5181 -10.2797 -9.3230 -8.6593 -8.0519 1.0058 2.9341 3.0956 3.3646 3.8139 4.5594 4.6143 4.7474 4.8982 5.2817 5.3570 5.5426 5.5746 5.8314 6.0216 6.0594 6.2154 6.2944 6.3299 6.5616 6.6659 6.9280 6.9975 7.0395 7.1130 7.1718 7.4868 7.5869 7.6557 7.7278 8.1264 12.3259 13.2872 13.4677 13.6962 13.8305 13.9273 14.1393 14.3814 14.6495 14.7342 15.2980 16.0806 16.3279 16.5450 16.7423 16.7774 17.1914 17.3081 17.6942 18.1651 18.6216 19.1738 19.3613 19.8166 20.0781 21.5375 21.6404 21.7847 23.2603 23.4200 24.3035 24.3358 24.9600 26.3089 26.4776 27.0895 27.1467 27.2462 27.6670 27.7292 27.7508 27.9895 28.0064 28.1304 28.1947 28.5352 28.5845 28.8659 28.9029 29.0800 29.5091 29.6914 29.7253 29.9266 30.0151 30.2553 30.4797 30.5324 31.5147 33.6426 34.4407 35.7003 36.0815 36.2483 36.3340 36.6213 36.7047 37.0565 37.0775 37.4712 37.5363 37.6932 39.0031 39.4923 40.0008 40.4252 40.7139 41.4207 42.2327 43.0463 44.0284 44.4315 44.5649 47.3423 47.6381 48.2582 48.3980 48.5966 48.6843 48.8253 49.3920 49.8292 49.9639 51.3967 51.6900 52.0415 52.1349 52.6125 52.8325 53.2654 54.1042 57.6595 57.7621 57.8676 58.0446 59.0434 59.1457 59.9914 60.3501 61.0136 61.9801 62.3504 62.9178 63.1262 63.4466 63.5016 63.5777 63.6884 63.7290 64.2685 64.4288 64.8553 65.2643 67.1555 67.8307 72.4580 72.6786 73.7447 74.0260 74.4946 74.7721 74.8427 75.2252 76.1766 77.6252 78.6061 83.7369 369.5896 369.6494 377.5488 377.6664 378.0116 378.0305 383.9590 384.3187 522.9875 527.8363 889.5287 894.7584 electronvolt
chargesum: 0.0000000
charge: -0.684158 0.025203 -0.613375 -0.620706 -0.613910 1.267905 -0.516510 -0.517393 -0.683839 0.025470 -0.622165 -0.614791 -0.611964 0.368760 0.230014 0.223767 0.211356 0.240763 0.213036 0.221246 0.244089 0.229623 0.207368 0.368911 0.240475 0.213203 0.221881 0.225218 0.211618 0.229223 0.206591 0.242536 0.230554
charge: -0.397023 -0.050426 -0.362495 -0.345403 -0.352211 1.124383 -0.489953 -0.490864 -0.397019 -0.050427 -0.345550 -0.362927 -0.351980 0.248474 0.132316 0.131277 0.128413 0.137885 0.124910 0.132565 0.141088 0.132597 0.126504 0.248428 0.137744 0.124883 0.132809 0.131947 0.128428 0.131908 0.126081 0.140636 0.133002
qa: -0.6842 0.0252 -0.6134 -0.6207 -0.6139 1.2679 -0.5165 -0.5174 -0.6838 0.0255 -0.6222 -0.6148 -0.6120 0.3688 0.2300 0.2238 0.2114 0.2408 0.2130 0.2212 0.2441 0.2296 0.2074 0.3689 0.2405 0.2132 0.2219 0.2252 0.2116 0.2292 0.2066 0.2425 0.2306
va: 2.7910 3.8431 3.6818 3.6847 3.6932 3.4075 0.8118 0.8105 2.7906 3.8424 3.6847 3.6820 3.6931 0.8470 0.9164 0.9176 0.9150 0.9092 0.9188 0.9162 0.9117 0.9182 0.9148 0.8470 0.9093 0.9187 0.9161 0.9172 0.9149 0.9164 0.9148 0.9121 0.9185
dispersion: -0.020780791 hartree
energy: -1022.479992359035 hartree
dipole: 0.09386 -0.08422 0.00964 -1.35211 1.18025 -0.17185 -3.07762 2.69343 -0.38419
magnitude: 0.42098 au
magnitude: 1.07006 debye
