program: Orca
programVersion: 5.0.4
elementType: N C C C C S N C C C C O H H H H H H H H H H H H H H H H H H H H
charge: 0
multiplicity: 1
keywords: Opt RIJCOSX PBEh-3c
formula: C8H20N2OS
InChI: InChI=1/C8H20N2OS/c1-7(2,3)9-12(11)10-8(4,5)6/h9-10H,1-6H3
32 atoms
N  -1.350421 -0.165647 -0.995659
C  -2.410707 0.136372 -0.021513
C  -2.911279 1.579724 -0.133379
C  -3.552119 -0.82889 -0.337661
C  -1.898134 -0.12927 1.390715
S  0.102377 0.742477 -0.911132
N  0.960174 -0.490917 -0.151426
C  2.352413 -0.2515 0.25462
C  3.309686 -0.224552 -0.939226
C  2.722013 -1.404212 1.187139
C  2.444628 1.063843 1.026265
O  0.491727 0.914276 -2.331746
H  -1.682257 -0.049679 -1.949159
H  -3.725386 1.7665 0.568346
H  -3.284651 1.791442 -1.137478
H  -2.11854 2.296761 0.086564
H  -3.218347 -1.863459 -0.261161
H  -4.380537 -0.681742 0.356104
H  -3.939087 -0.671579 -1.346974
H  -1.106602 0.563778 1.67796
H  -1.50226 -1.139993 1.480729
H  -2.711453 -0.009812 2.107558
H  0.835206 -1.371578 -0.644329
H  3.261648 -1.159291 -1.501568
H  3.069958 0.583508 -1.629338
H  4.340108 -0.093863 -0.604605
H  2.059518 -1.432699 2.052365
H  3.748253 -1.298745 1.54132
H  2.651971 -2.366831 0.675809
H  2.278966 1.935024 0.390972
H  3.441655 1.166349 1.455493
H  1.721476 1.094107 1.842296
totalener: -898.28522765 hartree
nucrepener: 943.77208940 hartree
electener: -1842.05731705 hartree
oneelecener: -3103.49078509 hartree
twoeener: 1261.43346804 hartree
kineticenergy: 893.67155893 hartree
exchangeener: -53.128766761680 hartree
correlationener: -4.727358044316 hartree
xcener: -57.856124805996 hartree
dispersion: -0.020317939 hartree
dispersion: -0.020325826 hartree
energy: -2441.5220 -529.1225 -398.4667 -398.4381 -285.5057 -285.4819 -283.8532 -283.8008 -283.7962 -283.7757 -283.7028 -283.5396 -226.9868 -169.6055 -169.5829 -169.3991 -30.9946 -27.7955 -27.3516 -24.1997 -23.4663 -21.2744 -21.1621 -21.0980 -20.9743 -19.6032 -17.3644 -17.1911 -15.5201 -14.9361 -14.7179 -14.1406 -13.9007 -13.7182 -13.1868 -13.1373 -12.5588 -12.3701 -12.0777 -11.9785 -11.9076 -11.7252 -11.4865 -11.4597 -11.3829 -10.7986 -10.6768 -10.5925 -10.5345 -9.3350 -8.9778 -7.9268 -7.2678 1.7735 2.7906 3.3226 3.7802 3.8846 4.5134 4.6272 4.8560 4.8807 5.0639 5.2107 5.5429 5.6309 5.8163 6.0244 6.1214 6.2435 6.3053 6.4316 6.6049 6.7736 6.8537 6.9462 7.0103 7.1505 7.3293 7.4082 7.5062 7.8736 8.1098 8.5409 11.6015 13.3911 13.6803 13.9294 13.9589 14.1801 14.3920 14.6144 14.7196 15.0445 15.2899 16.0590 16.6849 16.7554 16.9921 17.1106 17.4078 17.5349 17.9322 19.0269 19.1626 19.5632 20.0068 20.6400 20.7815 21.5669 21.6851 22.2017 22.8099 23.8853 24.4831 24.6053 25.2193 26.2724 26.6298 27.0806 27.4422 27.5907 27.6377 27.7669 27.9317 27.9651 28.1063 28.1160 28.4177 28.4551 28.6731 28.8691 29.1776 29.3707 29.5643 29.9191 30.0621 30.1146 30.4675 31.0181 31.4020 32.0338 32.6469 32.9980 33.4802 34.6732 35.8887 37.0096 38.5333 39.4477 39.8345 40.0036 40.2014 40.7244 41.0827 41.4754 44.1122 44.9591 46.0127 46.3841 48.7050 48.7788 48.8788 49.1595 49.4576 49.9635 51.6484 51.8608 51.9693 52.0774 52.1741 52.6529 52.8162 53.1139 55.3889 57.2441 57.4749 57.7130 57.8967 57.9887 58.9483 59.4285 59.7911 60.1491 60.2904 60.9250 62.2898 62.6928 62.8947 63.0262 63.2872 63.4185 63.4882 63.5385 63.6902 64.0679 64.2173 64.7970 65.7036 66.3762 67.3501 72.6967 72.9305 74.2416 74.6072 74.9866 75.0283 75.1656 75.3635 76.8517 77.7431 79.0166 369.5658 369.7001 377.5630 377.7116 377.9079 378.0318 384.0463 384.2231 523.5135 524.3731 698.3922 electronvolt
chargesum: 0.0000000
charge: -0.708888 0.041955 -0.620570 -0.614274 -0.614599 0.996703 -0.709630 0.054289 -0.610850 -0.609743 -0.639102 -0.679728 0.358226 0.215171 0.215464 0.227985 0.235388 0.216061 0.212070 0.224186 0.235362 0.211636 0.354386 0.210363 0.250712 0.203799 0.231577 0.214230 0.211879 0.233306 0.223246 0.229387
charge: -0.441865 -0.054842 -0.365452 -0.346089 -0.352675 0.920001 -0.434640 -0.051686 -0.361648 -0.345925 -0.357998 -0.635973 0.242687 0.129954 0.126793 0.130133 0.135627 0.129921 0.124859 0.127900 0.136867 0.127350 0.239743 0.126064 0.141949 0.125001 0.133741 0.128690 0.124820 0.131649 0.132971 0.132074
qa: -0.7089 0.0420 -0.6206 -0.6143 -0.6146 0.9967 -0.7096 0.0543 -0.6108 -0.6097 -0.6391 -0.6797 0.3582 0.2152 0.2155 0.2280 0.2354 0.2161 0.2121 0.2242 0.2354 0.2116 0.3544 0.2104 0.2507 0.2038 0.2316 0.2142 0.2119 0.2333 0.2232 0.2294
va: 2.7470 3.8427 3.6723 3.6880 3.6836 3.5951 2.7683 3.8235 3.6658 3.6899 3.6802 1.8336 0.8494 0.9161 0.9186 0.9171 0.9120 0.9170 0.9190 0.9193 0.9144 0.9155 0.8514 0.9212 0.9156 0.9171 0.9129 0.9174 0.9196 0.9121 0.9146 0.9139
dispersion: -0.020320883 hartree
energy: -898.253474219252 hartree
dipole: -0.83708 0.47617 -0.36091 -3.58581 3.15749 -0.42833 9.53224 -8.59678 0.93547
magnitude: 1.09033 au
magnitude: 2.77140 debye
