program: Orca
programVersion: 5.0.4
elementType: N C C C C S N C C C C H H H H H H H H H H H H H H H H H H H H
charge: 2
multiplicity: 1
keywords: Freq RIJCOSX PBEh-3c
frequency: 0.00 0.00 0.00 0.00 0.00 0.00 34.31 53.25 90.48 94.61 137.10 204.20 222.05 255.30 255.63 296.78 303.83 318.18 340.69 342.07 342.43 345.73 346.92 416.01 422.99 442.30 451.54 502.33 504.04 603.48 721.33 727.84 790.82 804.14 804.86 955.26 955.32 964.10 965.26 1007.20 1007.46 1043.77 1064.04 1068.49 1071.59 1098.12 1121.00 1194.31 1204.18 1273.69 1276.54 1288.51 1308.15 1395.91 1429.04 1455.69 1456.81 1461.67 1463.34 1491.55 1496.91 1507.06 1510.45 1511.21 1511.46 1515.31 1515.88 1539.82 1541.24 1547.46 1548.08 1553.06 1554.17 3098.15 3099.51 3123.88 3124.14 3126.26 3126.69 3180.98 3182.09 3211.06 3212.11 3212.35 3212.50 3216.16 3216.38 3226.30 3226.88 3227.82 3228.00 3505.31 3515.75
frequency: 34.31 53.25 90.48 94.61 137.10 204.20 222.05 255.30 255.63 296.78 303.83 318.18 340.69 342.07 342.43 345.73 346.92 416.01 422.99 442.30 451.54 502.33 504.04 603.48 721.33 727.84 790.82 804.14 804.86 955.26 955.32 964.10 965.26 1007.20 1007.46 1043.77 1064.04 1068.49 1071.59 1098.12 1121.00 1194.31 1204.18 1273.69 1276.54 1288.51 1308.15 1395.91 1429.04 1455.69 1456.81 1461.67 1463.34 1491.55 1496.91 1507.06 1510.45 1511.21 1511.46 1515.31 1515.88 1539.82 1541.24 1547.46 1548.08 1553.06 1554.17 3098.15 3099.51 3123.88 3124.14 3126.26 3126.69 3180.98 3182.09 3211.06 3212.11 3212.35 3212.50 3216.16 3216.38 3226.30 3226.88 3227.82 3228.00 3505.31 3515.75
formula: C8H20N2S
InChI: InChI=1/C8H20N2S/c1-7(2,3)9-11-10-8(4,5)6/h9-10H,1-6H3
31 atoms
N  1.30464 -0.580802 0.006456
C  2.693904 0.076841 0.196522
C  3.508211 -0.364418 -1.015101
C  2.521615 1.580221 0.26444
C  3.226894 -0.508187 1.499993
S  -0.007882 0.252178 -0.091466
N  -1.260903 -0.659968 -0.245641
C  -2.693706 -0.090411 -0.390336
C  -3.469457 -0.674329 0.785781
C  -2.62863 1.422462 -0.35141
C  -3.188609 -0.617978 -1.732566
H  1.306782 -1.603829 -0.04349
H  3.103612 0.019148 -1.951014
H  4.515256 0.038795 -0.902068
H  3.608813 -1.448305 -1.082027
H  1.923909 1.911217 1.118599
H  2.131771 2.016626 -0.659321
H  3.507513 2.022479 0.407428
H  2.620918 -0.22856 2.361031
H  4.228904 -0.10702 1.657692
H  3.325185 -1.593778 1.463933
H  -1.190784 -1.681668 -0.265618
H  -3.090093 -0.331063 1.747515
H  -3.491654 -1.764631 0.774262
H  -4.503335 -0.337542 0.700151
H  -3.64475 1.801304 -0.45938
H  -2.263436 1.818984 0.600014
H  -2.06177 1.853773 -1.181223
H  -2.607357 -0.234376 -2.570339
H  -4.217317 -0.279531 -1.863179
H  -3.208142 -1.707633 -1.77504
totalener: -822.52688016 hartree
nucrepener: 792.42581807 hartree
electener: -1614.95269823 hartree
oneelecener: -2663.81041043 hartree
twoeener: 1048.85771220 hartree
kineticenergy: 818.45746636 hartree
exchangeener: -48.148803575758 hartree
correlationener: -4.260004925337 hartree
xcener: -52.408808501095 hartree
energy: -2452.7686 -410.8210 -410.8204 -294.6669 -294.6665 -291.7958 -291.7930 -291.4503 -291.4493 -291.4418 -291.4403 -238.4698 -181.0641 -180.9812 -180.9003 -41.1780 -38.4314 -33.8129 -32.6670 -31.2203 -29.5628 -28.9176 -28.9015 -28.8699 -27.6140 -27.2494 -26.1737 -24.1617 -23.7291 -22.9724 -22.6545 -22.2077 -21.4081 -21.3873 -21.3322 -20.5341 -19.9490 -19.8717 -19.7209 -19.6329 -19.3953 -19.2375 -19.2320 -19.0177 -18.7587 -18.7473 -18.7305 -18.0722 -12.7212 -8.5023 -8.2190 -6.2581 -4.3764 -3.9014 -3.7969 -3.6473 -3.1242 -2.4745 -2.4418 -2.2762 -1.9810 -1.9601 -1.8703 -1.6321 -1.4565 -1.2072 -1.1373 -1.1333 -0.9751 -0.7078 -0.6325 -0.6242 -0.6192 -0.4488 -0.4116 -0.2816 0.2470 0.2685 0.3411 1.0531 4.0590 5.1244 5.7265 5.8321 5.8598 6.1136 6.4681 6.4929 6.8148 6.9615 7.5012 7.5276 7.7198 7.8357 8.2868 9.3113 9.5620 9.7501 9.8006 10.1343 10.2938 10.6135 11.5073 11.6514 12.1191 12.8479 14.1156 14.6711 14.6851 15.6607 16.0437 16.4610 17.0436 17.4389 17.8877 18.4904 19.6558 19.9563 20.2926 20.3066 20.4406 20.4935 20.6255 20.7414 20.7449 20.8893 21.0831 21.4806 21.5462 21.5994 21.8455 22.2115 22.3177 22.5908 22.6218 23.1417 23.4791 24.7572 25.0347 25.3410 29.6696 30.0508 30.2451 31.3146 31.4234 31.4375 32.2966 32.7728 34.4046 36.0824 36.3319 36.6742 38.5488 39.3952 40.5984 40.6196 41.1128 41.3821 42.2160 42.3540 44.0179 44.1046 44.1947 44.3989 47.5689 48.2490 48.8308 48.8799 49.4104 49.8925 50.7715 51.1340 51.5596 51.8937 52.6452 53.3011 53.8846 54.9870 55.1789 55.2247 55.4878 55.5017 55.5319 55.5340 56.0763 56.1695 56.9723 58.9751 63.2913 63.5816 65.0395 65.6911 66.2811 66.2872 66.3371 66.4189 67.0162 68.0451 360.8710 361.2505 369.7226 369.8133 369.9600 370.1765 375.2137 375.2723 510.3485 510.8133 electronvolt
chargesum: 2.0000000
charge: -0.625641 -0.035544 -0.608289 -0.702926 -0.609277 1.094648 -0.625517 -0.035786 -0.608590 -0.702000 -0.608967 0.468756 0.267420 0.311953 0.265643 0.264298 0.266159 0.344902 0.267029 0.312503 0.265575 0.468673 0.267700 0.265448 0.312065 0.344644 0.265890 0.264396 0.266797 0.312493 0.265545
charge: -0.259027 -0.012462 -0.341325 -0.375571 -0.341492 1.035718 -0.258885 -0.012445 -0.341336 -0.375231 -0.341500 0.311773 0.155881 0.186048 0.155728 0.152703 0.153415 0.198831 0.155612 0.186276 0.155603 0.311695 0.155968 0.155666 0.186117 0.198761 0.153321 0.152773 0.155535 0.186255 0.155594
qa: -0.6256 -0.0355 -0.6083 -0.7029 -0.6093 1.0946 -0.6255 -0.0358 -0.6086 -0.7020 -0.6090 0.4688 0.2674 0.3120 0.2656 0.2643 0.2662 0.3449 0.2670 0.3125 0.2656 0.4687 0.2677 0.2654 0.3121 0.3446 0.2659 0.2644 0.2668 0.3125 0.2655
va: 3.0521 3.6403 3.5684 3.5767 3.5681 3.0918 3.0522 3.6405 3.5683 3.5770 3.5681 0.7646 0.8970 0.8794 0.8989 0.8941 0.8934 0.8677 0.8971 0.8793 0.8989 0.7646 0.8968 0.8990 0.8794 0.8678 0.8935 0.8941 0.8972 0.8793 0.8990
dispersion: -0.018133426 hartree
energy: -822.499759113330 hartree
dipole: -0.00474 0.03549 0.03076 0.05817 -0.92367 -0.86550 0.02036 -0.05026 -0.02989
magnitude: 0.86656 au
magnitude: 2.20262 debye
temp: 298.15 k
press: 1.00 atm
zeropoint: 0.28550140 hartree
thermalvibcorrection: 0.01172578 hartree
thermalrotcorrection: 0.00141627 hartree
thermaltrasncorrection: 0.00141627 hartree
thermaltotal: -822.19969939 hartree
thermalcorr: 0.01455832 hartree
nonthermalcorr: 0.28550140 hartree
totalcorr: 0.30005972 hartree
thermalcorrenthalpy: 0.00094421 hartree
totalenthalpy: -822.19875518 hartree
vibrat: 0.02001351 hartree
rotat: 0.01481704 hartree
transl: 0.01967447 hartree
total: 0.05450502 hartree
totalentropycorr: -0.05450502 hartree
gibbsenthalpy: -822.25326020 hartree
gibbsminuselec: 0.24649892 hartree
