program: Orca
programVersion: 5.0.4
elementType: N C C C C S F F N C C C C C C C C H H H H H H H H H H H H H H H H H H H H H H H H H H H H
charge: 0
multiplicity: 1
keywords: SP DSD-BLYP D3BJ def2-QZVPP def2-QZVPP/C def2/J TightSCF
formula: C12H28F2N2S
InChI: InChI=1/C12H28F2N2S/c1-10(2,3)15-17(13,14)16(11(4,5)6)12(7,8)9/h15H,1-9H3
45 atoms
N  1.392078 0.870565 0.134086
C  2.806164 0.857235 -0.330809
C  3.399371 2.112089 0.318616
C  3.596232 -0.362571 0.14541
C  2.908614 1.013496 -1.844965
S  0.512752 -0.552075 0.381438
F  0.965112 -1.079828 -1.187484
F  0.188882 0.144667 2.010457
N  -1.090584 -0.379415 -0.07512
C  -1.587326 0.88631 -0.711256
C  -0.785731 1.200673 -1.983338
C  -3.03214 0.760135 -1.214562
C  -1.550277 2.078279 0.255483
C  -1.976104 -1.365557 0.643689
C  -2.872752 -2.095856 -0.372418
C  -1.160364 -2.495547 1.30744
C  -2.811035 -0.72265 1.755658
H  1.326234 1.345794 1.023444
H  4.425401 2.260549 -0.016805
H  2.829131 3.002498 0.04767
H  3.417809 2.03239 1.408038
H  4.652329 -0.235421 -0.095843
H  3.517484 -0.486854 1.227222
H  3.2607 -1.280293 -0.333996
H  3.956671 1.111746 -2.133307
H  2.390392 1.913688 -2.177299
H  2.493069 0.163452 -2.377037
H  -0.789535 0.347245 -2.659096
H  0.239994 1.479545 -1.783737
H  -1.257786 2.039982 -2.496809
H  -3.29637 1.719211 -1.660112
H  -3.132798 0.009447 -1.995662
H  -3.769874 0.56924 -0.440161
H  -2.011303 2.946267 -0.21892
H  -2.098219 1.866957 1.171527
H  -0.538762 2.363398 0.524984
H  -3.713568 -1.510691 -0.727085
H  -2.287125 -2.414923 -1.234575
H  -3.295215 -2.987224 0.092885
H  -0.540987 -2.159038 2.134986
H  -0.544736 -3.044744 0.593573
H  -1.877126 -3.205032 1.720939
H  -3.506326 0.028878 1.389669
H  -3.408685 -1.488997 2.252899
H  -2.166718 -0.258655 2.498923
totalener: -1179.00231801 hartree
nucrepener: 1738.53930598 hartree
electener: -2917.54162399 hartree
oneelecener: -5075.89939811 hartree
twoeener: 2158.35777412 hartree
kineticenergy: 1176.74371132 hartree
exchangeener: -40.593329810281 hartree
correlationener: -2.752623848741 hartree
xcener: -43.345953659022 hartree
chargesum: -0.0000000
charge: -0.518777 0.267797 -0.207051 -0.212541 -0.179756 1.148792 -0.516740 -0.573789 -0.482612 0.349085 -0.253048 -0.223113 -0.180889 0.349975 -0.201374 -0.261042 -0.184251 0.196676 0.062617 0.072802 0.057306 0.053928 0.070346 0.077170 0.051392 0.048778 0.078642 0.064630 0.080753 0.047997 0.065215 0.071899 0.054101 0.045651 0.057646 0.053418 0.041398 0.070584 0.052831 0.093502 0.083842 0.053852 0.035977 0.054814 0.081569
charge: 0.362380 -0.378621 0.238923 0.231064 0.236368 0.402684 -0.086982 -0.183053 0.220411 -0.337470 0.242395 0.241406 0.243654 -0.339281 0.247020 0.207695 0.242037 -0.245887 -0.049008 -0.052471 -0.053861 -0.051006 -0.055186 -0.059436 -0.053400 -0.057183 -0.062901 -0.053829 -0.077317 -0.054003 -0.047450 -0.052658 -0.066156 -0.054119 -0.056846 -0.068295 -0.071150 -0.050167 -0.053736 -0.062103 -0.055284 -0.050116 -0.070170 -0.051207 -0.055684
qa: -0.5188 0.2678 -0.2071 -0.2125 -0.1798 1.1488 -0.5167 -0.5738 -0.4826 0.3491 -0.2530 -0.2231 -0.1809 0.3500 -0.2014 -0.2610 -0.1843 0.1967 0.0626 0.0728 0.0573 0.0539 0.0703 0.0772 0.0514 0.0488 0.0786 0.0646 0.0808 0.0480 0.0652 0.0719 0.0541 0.0457 0.0576 0.0534 0.0414 0.0706 0.0528 0.0935 0.0838 0.0539 0.0360 0.0548 0.0816
va: 2.7767 3.6898 3.8662 3.8783 3.8614 3.5144 0.6949 0.6293 2.6936 3.5909 3.8770 3.8614 3.8855 3.5171 3.8745 3.8724 3.8827 1.0301 1.0019 0.9995 0.9982 1.0006 1.0005 1.0039 0.9972 0.9987 1.0181 1.0175 0.9948 0.9905 0.9976 0.9969 1.0027 0.9918 1.0092 1.0156 0.9927 1.0134 1.0021 0.9992 0.9959 0.9929 1.0007 0.9996 1.0189
total: -1180.733984231 hartree
dispersion: -0.034534642 hartree
energy: -1180.768518873145 hartree
dipole: -6.45394 6.37272 -0.08122 6.63430 -6.25661 0.37769 -4.77304 4.62040 -0.15264
magnitude: 0.41538 au
magnitude: 1.05582 debye
