program: Orca
programVersion: 5.0.4
elementType: N C C C C S N C C C C C C C C O H H H H H H H H H H H H H H H H H H H H H H H H H H H H
charge: 0
multiplicity: 1
keywords: SP DSD-BLYP D3BJ def2-QZVPP def2-QZVPP/C def2/J TightSCF
formula: C12H28N2OS
InChI: InChI=1/C12H28N2OS/c1-10(2,3)13-16(15)14(11(4,5)6)12(7,8)9/h13H,1-9H3
44 atoms
N  1.477753 0.010539 -0.613982
C  2.921516 -0.081561 -0.351021
C  3.329984 0.970916 0.678507
C  3.33475 -1.475352 0.130534
C  3.609949 0.223132 -1.681118
S  0.430123 0.216198 0.704596
N  -1.02962 0.135426 -0.181024
C  -1.781789 1.410621 0.083609
C  -3.127796 1.493451 -0.636446
C  -0.942156 2.570662 -0.474086
C  -2.051745 1.644137 1.579674
C  -1.678474 -1.196128 -0.395093
C  -2.54466 -1.626704 0.793098
C  -0.63136 -2.298586 -0.648714
C  -2.520201 -1.198871 -1.684717
O  0.528541 -0.894026 1.691148
H  1.165948 -0.697451 -1.266542
H  2.989029 1.96449 0.38492
H  4.417013 0.998537 0.760101
H  2.941479 0.750958 1.674142
H  4.416253 -1.534124 0.266134
H  2.856004 -1.727906 1.074846
H  3.055997 -2.237003 -0.601533
H  3.320494 -0.494637 -2.452142
H  3.350635 1.220335 -2.037038
H  4.694044 0.165039 -1.574629
H  -3.541772 2.483012 -0.442136
H  -3.029185 1.390516 -1.715077
H  -3.858544 0.774068 -0.272482
H  -0.716277 2.404568 -1.527107
H  -1.496414 3.50636 -0.38562
H  0.000557 2.707046 0.053673
H  -1.135396 1.714175 2.165683
H  -2.660117 0.849826 2.00956
H  -2.58795 2.584439 1.718106
H  -2.977436 -2.611272 0.606754
H  -3.374605 -0.940809 0.956899
H  -1.954729 -1.681999 1.706052
H  0.085666 -2.431462 0.154451
H  -0.104195 -2.144047 -1.593553
H  -1.166665 -3.24182 -0.758518
H  -2.706554 -2.232679 -1.978561
H  -3.493201 -0.729643 -1.587272
H  -1.981413 -0.715503 -2.499901
totalener: -1054.73760232 hartree
nucrepener: 1512.52966209 hartree
electener: -2567.26726441 hartree
oneelecener: -4448.38783770 hartree
twoeener: 1881.12057330 hartree
kineticenergy: 1052.58789003 hartree
exchangeener: -36.883306007873 hartree
correlationener: -2.535806035682 hartree
xcener: -39.419112043555 hartree
chargesum: -0.0000000
charge: -0.477638 0.228572 -0.195360 -0.168738 -0.175151 0.781074 -0.505142 0.309333 -0.203104 -0.232325 -0.186295 0.340197 -0.175297 -0.264197 -0.213639 -0.635818 0.160856 0.072847 0.060138 0.071095 0.050392 0.085663 0.032977 0.033605 0.071108 0.051205 0.065452 0.069908 0.049835 0.067750 0.052073 0.061523 0.067997 0.052236 0.052081 0.051463 0.029535 0.086523 0.107036 0.050393 0.050052 0.059235 0.050944 0.059609
charge: 0.344356 -0.405459 0.227041 0.237606 0.236553 0.367971 0.212104 -0.372117 0.238399 0.229735 0.234445 -0.350351 0.240412 0.233350 0.241846 -0.146624 -0.220991 -0.055227 -0.050561 -0.055974 -0.055786 -0.057070 -0.059533 -0.057868 -0.053910 -0.053768 -0.047668 -0.052501 -0.060710 -0.054242 -0.054432 -0.068727 -0.063866 -0.059242 -0.052927 -0.052894 -0.066877 -0.052328 -0.073372 -0.063154 -0.050049 -0.051659 -0.069519 -0.054411
qa: -0.4776 0.2286 -0.1954 -0.1687 -0.1752 0.7811 -0.5051 0.3093 -0.2031 -0.2323 -0.1863 0.3402 -0.1753 -0.2642 -0.2136 -0.6358 0.1609 0.0728 0.0601 0.0711 0.0504 0.0857 0.0330 0.0336 0.0711 0.0512 0.0655 0.0699 0.0498 0.0677 0.0521 0.0615 0.0680 0.0522 0.0521 0.0515 0.0295 0.0865 0.1070 0.0504 0.0501 0.0592 0.0509 0.0596
va: 2.7950 3.8149 3.8559 3.8574 3.8704 3.7123 2.5875 3.6264 3.8551 3.8888 3.8961 3.5736 3.8712 3.8512 3.8720 1.8019 1.0378 1.0011 0.9951 0.9986 0.9982 1.0148 1.0025 1.0030 1.0074 1.0011 0.9985 0.9984 1.0004 1.0162 0.9948 1.0048 1.0039 1.0067 0.9967 1.0024 1.0013 1.0174 1.0285 0.9998 0.9978 0.9999 0.9929 1.0149
total: -1056.313415047 hartree
dispersion: -0.033825663 hartree
energy: -1056.347240710097 hartree
dipole: -3.27733 2.98983 -0.28750 0.06864 0.23260 0.30124 -6.71725 5.76970 -0.94755
magnitude: 1.03502 au
magnitude: 2.63081 debye
