program: Orca
programVersion: 5.0.4
elementType: N C C C C S N C C C C C C C C H H H H H H H H H H H H H H H H H H H H H H H H H H H H
charge: 2
multiplicity: 1
keywords: SP DSD-BLYP D3BJ def2-QZVPP def2-QZVPP/C def2/J TightSCF
formula: C12H28N2S
InChI: InChI=1/C12H28N2S/c1-10(2,3)13-15-14(11(4,5)6)12(7,8)9/h13H,1-9H3
43 atoms
N  1.453095 -0.509053 -0.504206
C  2.970184 -0.298741 -0.606029
C  3.361437 0.986561 0.098133
C  3.580769 -1.525084 0.064646
C  3.278381 -0.250159 -2.098714
S  0.518597 0.536655 0.183643
N  -1.005817 0.184921 0.169225
C  -1.810681 1.240993 1.060762
C  -0.873775 2.353317 1.537669
C  -2.320892 0.483722 2.280383
C  -2.902616 1.87711 0.205647
C  -1.598291 -1.098606 -0.48046
C  -3.117006 -1.039338 -0.600478
C  -1.049918 -1.24159 -1.916977
C  -1.203103 -2.267069 0.42953
H  1.092285 -1.349804 -0.95103
H  2.929815 1.880554 -0.35881
H  3.144777 0.975557 1.169187
H  4.441613 1.098932 0.011146
H  3.296678 -2.454318 -0.43102
H  4.665925 -1.448026 -0.00569
H  3.32256 -1.590501 1.121175
H  2.971824 -1.159537 -2.616788
H  4.358242 -0.165081 -2.220856
H  2.82275 0.610194 -2.588025
H  -0.45331 2.960788 0.732283
H  -1.487282 3.034429 2.126613
H  -0.080329 2.028985 2.215449
H  -2.860589 1.197821 2.903647
H  -3.019301 -0.316118 2.056067
H  -1.505779 0.083526 2.883228
H  -3.241626 2.770433 0.729308
H  -2.533496 2.203006 -0.766303
H  -3.77605 1.252934 0.069593
H  -3.646312 -0.899912 0.335313
H  -3.449847 -0.304899 -1.329174
H  -3.422577 -2.015798 -0.976271
H  -0.827754 -0.289467 -2.399496
H  -1.818929 -1.709454 -2.529098
H  -0.195586 -1.913823 -2.016439
H  -0.130038 -2.375519 0.595785
H  -1.68548 -2.200926 1.40247
H  -1.540819 -3.190788 -0.040856
totalener: -979.04142799 hartree
nucrepener: 1331.19383868 hartree
electener: -2310.23526667 hartree
oneelecener: -3942.01481805 hartree
twoeener: 1631.77955138 hartree
kineticenergy: 977.05924539 hartree
exchangeener: -34.124915060928 hartree
correlationener: -2.337329899293 hartree
xcener: -36.462244960221 hartree
chargesum: 2.0000000
charge: -0.288500 0.069191 -0.132871 -0.110684 -0.101092 0.780647 -0.188377 0.105628 -0.162916 -0.147760 -0.144737 0.101191 -0.186289 -0.199828 -0.132486 0.236913 0.068201 0.070765 0.124379 0.062848 0.112603 0.082642 0.060717 0.113230 0.080056 0.085983 0.123445 0.077339 0.125574 0.082593 0.082206 0.110310 0.079515 0.094142 0.078434 0.105874 0.117390 0.092850 0.136203 0.072428 0.031254 0.103874 0.127118
charge: 0.409208 -0.328541 0.249990 0.280225 0.280858 0.953608 0.264262 -0.279269 0.227036 0.280909 0.287427 -0.287268 0.275766 0.279302 0.271647 -0.161335 -0.046786 -0.046013 -0.014687 -0.042360 -0.021145 -0.043679 -0.043065 -0.021121 -0.043685 -0.043114 -0.013148 -0.048833 -0.018055 -0.053733 -0.041954 -0.022591 -0.041313 -0.050166 -0.051864 -0.038080 -0.020068 -0.046207 -0.018690 -0.055164 -0.059296 -0.037929 -0.021080
qa: -0.2885 0.0692 -0.1329 -0.1107 -0.1011 0.7806 -0.1884 0.1056 -0.1629 -0.1478 -0.1447 0.1012 -0.1863 -0.1998 -0.1325 0.2369 0.0682 0.0708 0.1244 0.0628 0.1126 0.0826 0.0607 0.1132 0.0801 0.0860 0.1234 0.0773 0.1256 0.0826 0.0822 0.1103 0.0795 0.0941 0.0784 0.1059 0.1174 0.0928 0.1362 0.0724 0.0313 0.1039 0.1271
va: 3.2404 3.8919 3.8762 3.8583 3.8618 3.3851 3.0576 3.8017 3.8827 3.8840 3.8702 3.7640 3.8803 3.8584 3.8800 1.0298 0.9938 0.9953 0.9951 0.9975 0.9989 0.9970 0.9971 0.9988 0.9969 0.9961 0.9934 0.9927 0.9957 1.0053 0.9999 0.9974 1.0042 0.9935 1.0075 0.9881 0.9907 1.0049 0.9955 0.9986 1.0097 1.0055 0.9965
total: -980.477838482 hartree
dispersion: -0.031430121 hartree
energy: -980.509268602758 hartree
dipole: -2.47832 2.76222 0.28390 -3.10057 3.01807 -0.08249 -0.83131 0.69852 -0.13279
magnitude: 0.32410 au
magnitude: 0.82379 debye
