program: Orca
programVersion: 5.0.4
elementType: N S F N C C H H H H H H H H
charge: 1
multiplicity: 1
keywords: Freq RIJCOSX PBEh-3c
frequency: 0.00 0.00 0.00 0.00 0.00 0.00 55.75 88.77 207.73 255.53 284.95 340.60 395.91 419.45 453.82 505.56 586.49 797.64 841.06 884.68 989.74 1022.63 1110.94 1114.11 1146.83 1215.18 1345.67 1419.51 1481.16 1496.77 1533.52 1545.41 1547.93 1668.94 3132.80 3149.00 3205.03 3223.82 3230.20 3584.14 3593.20 3702.58
frequency: 55.75 88.77 207.73 255.53 284.95 340.60 395.91 419.45 453.82 505.56 586.49 797.64 841.06 884.68 989.74 1022.63 1110.94 1114.11 1146.83 1215.18 1345.67 1419.51 1481.16 1496.77 1533.52 1545.41 1547.93 1668.94 3132.80 3149.00 3205.03 3223.82 3230.20 3584.14 3593.20 3702.58
formula: C2H8FN2S
InChI: InChI=1/C2H8FN2S/c1-2-5-6(3)4/h5H,2,4H2,1H3
14 atoms
N  2.722006 0.061011 -0.446289
S  1.243624 0.64486 -0.643365
F  1.114691 1.74263 0.53002
N  0.298164 -0.553544 -0.20058
C  -1.154381 -0.483638 -0.493139
C  -1.96665 0.136023 0.623883
H  3.024037 -0.351595 0.430184
H  3.4509 0.521232 -0.978302
H  0.574878 -1.138271 0.583257
H  -1.456827 -1.510609 -0.691664
H  -1.275699 0.060601 -1.431284
H  -1.856605 -0.415365 1.55749
H  -1.696364 1.175688 0.803139
H  -3.021873 0.110878 0.35665
totalener: -687.22322592 hartree
nucrepener: 348.08476819 hartree
electener: -1035.30799411 hartree
oneelecener: -1623.82167410 hartree
twoeener: 588.51367999 hartree
kineticenergy: 684.54373919 hartree
exchangeener: -34.302235184955 hartree
correlationener: -2.689770042071 hartree
xcener: -36.992005227026 hartree
energy: -2449.1724 -688.8609 -405.2699 -405.2659 -290.0942 -287.9168 -234.6195 -177.2602 -177.1825 -177.0123 -42.1971 -35.8362 -33.3972 -28.4287 -26.6085 -24.1305 -23.1850 -22.6512 -22.4079 -20.1748 -19.7215 -19.2980 -18.4156 -17.5927 -16.6762 -16.1701 -15.9146 -15.4610 -14.4217 -4.8516 -4.3120 -2.7381 -1.6900 -0.3090 0.2264 0.3428 0.8951 1.4176 1.6044 1.9724 2.3060 3.0075 5.1385 7.6597 8.7576 9.1445 9.8948 10.2538 11.2128 12.0024 12.2079 12.3776 13.4996 13.9619 14.4471 16.0823 17.5257 18.4027 20.0133 21.4332 21.5110 21.8885 22.4227 22.6283 23.3891 23.9215 24.1202 24.3026 25.0089 25.4943 26.8469 27.8353 28.7482 29.2693 29.7360 30.1460 31.2486 32.6242 34.8314 35.4573 35.9516 36.3415 38.1266 41.0095 42.3952 44.6450 45.0580 46.1568 48.5811 49.7277 50.8003 51.2450 54.3855 55.6764 58.0243 58.9190 60.1866 60.6198 62.1952 62.9524 64.8652 67.5776 68.8728 72.1265 366.5430 375.2225 511.4592 515.4691 884.7068 electronvolt
chargesum: 1.0000000
charge: -0.862704 1.270711 -0.387548 -0.704869 -0.327714 -0.647445 0.438141 0.452820 0.423734 0.302248 0.275698 0.244101 0.243963 0.278863
charge: -0.516570 1.143886 -0.339739 -0.380574 -0.160434 -0.375010 0.286582 0.299119 0.280363 0.161354 0.150106 0.144047 0.142778 0.164092
qa: -0.8627 1.2707 -0.3875 -0.7049 -0.3277 -0.6474 0.4381 0.4528 0.4237 0.3022 0.2757 0.2441 0.2440 0.2789
va: 2.8367 3.3976 0.9717 2.9294 3.5890 3.6641 0.7928 0.7781 0.7977 0.8713 0.8862 0.9038 0.9075 0.8910
dispersion: -0.006228811 hartree
energy: -687.203878174254 hartree
dipole: -6.92338 7.94337 1.01998 -5.51639 4.69947 -0.81692 1.14230 -1.23295 -0.09065
magnitude: 1.30994 au
magnitude: 3.32960 debye
temp: 298.15 k
press: 1.00 atm
zeropoint: 0.11750118 hartree
thermalvibcorrection: 0.00507139 hartree
thermalrotcorrection: 0.00141627 hartree
thermaltrasncorrection: 0.00141627 hartree
thermaltotal: -687.07847305 hartree
thermalcorr: 0.00790394 hartree
nonthermalcorr: 0.11750118 hartree
totalcorr: 0.12540512 hartree
thermalcorrenthalpy: 0.00094421 hartree
totalenthalpy: -687.07752884 hartree
vibrat: 0.00858876 hartree
rotat: 0.01302112 hartree
transl: 0.01902106 hartree
total: 0.04063093 hartree
totalentropycorr: -0.04063093 hartree
gibbsenthalpy: -687.11815977 hartree
gibbsminuselec: 0.08571840 hartree
