program: Orca
programVersion: 5.0.4
elementType: N S F N C C H H H H H H H H
charge: 1
multiplicity: 1
keywords: SP DSD-BLYP D3BJ def2-QZVPP def2-QZVPP/C def2/J TightSCF
formula: C2H8FN2S
InChI: InChI=1/C2H8FN2S/c1-2-5-6(3)4/h5H,2,4H2,1H3
14 atoms
N  2.149907 -0.30918 -0.28962
S  0.671525 0.274669 -0.486696
F  0.542592 1.37244 0.68669
N  -0.273935 -0.923735 -0.04391
C  -1.72648 -0.853829 -0.336469
C  -2.538749 -0.234168 0.780553
H  2.451938 -0.721786 0.586854
H  2.878801 0.151041 -0.821632
H  0.002779 -1.508462 0.739927
H  -2.028927 -1.8808 -0.534995
H  -1.847798 -0.30959 -1.274614
H  -2.428704 -0.785555 1.71416
H  -2.268463 0.805498 0.959809
H  -3.593972 -0.259312 0.513319
totalener: -687.29420070 hartree
nucrepener: 348.08476793 hartree
electener: -1035.37896863 hartree
oneelecener: -1624.33237109 hartree
twoeener: 588.95340246 hartree
kineticenergy: 686.15187926 hartree
exchangeener: -19.059010762434 hartree
correlationener: -1.138112111574 hartree
xcener: -20.197122874008 hartree
chargesum: 1.0000000
charge: -0.361097 0.952511 -0.299184 -0.316616 0.062809 -0.122087 0.232155 0.249889 0.203638 0.108620 0.081602 0.055057 0.061612 0.091091
charge: 0.500499 0.546426 0.078369 0.350548 0.007446 0.249083 -0.165241 -0.164728 -0.165807 -0.038028 -0.043886 -0.054391 -0.058511 -0.041779
qa: -0.3611 0.9525 -0.2992 -0.3166 0.0628 -0.1221 0.2322 0.2499 0.2036 0.1086 0.0816 0.0551 0.0616 0.0911
va: 3.1561 3.6683 0.9951 3.1175 3.8298 3.8648 0.9994 0.9882 1.0168 0.9799 0.9877 1.0029 1.0069 1.0037
total: -687.928439505 hartree
dispersion: -0.007207319 hartree
energy: -687.935646823655 hartree
dipole: -6.92338 7.88133 0.95794 -5.51639 4.63190 -0.88448 1.14230 -1.31610 -0.17380
magnitude: 1.31536 au
magnitude: 3.34338 debye
