program: Orca
programVersion: 5.0.4
elementType: S F H H
charge: 1
multiplicity: 1
keywords: Opt RIJCOSX PBEh-3c
formula: H2FS
InChI: InChI=1/FH2S/c1-2/h2H2
4 atoms
S  -0.066704 0.007297 0.526579
F  1.339587 -0.184746 -0.137801
H  -0.50126 1.071476 -0.190252
H  -0.771723 -0.894028 -0.198525
totalener: -498.21251266 hartree
nucrepener: 65.66361111 hartree
electener: -563.87612377 hartree
oneelecener: -811.49296342 hartree
twoeener: 247.61683966 hartree
kineticenergy: 497.13212313 hartree
exchangeener: -19.892057759557 hartree
correlationener: -1.281807436425 hartree
xcener: -21.173865195983 hartree
dispersion: -0.000746492 hartree
energy: -2450.0168 -691.8245 -235.8611 -178.5205 -178.3418 -178.2290 -45.1102 -32.0793 -24.4855 -24.1985 -22.9105 -20.7891 -18.9546 -8.4817 -6.4878 -4.8245 4.4421 6.6548 7.8924 8.1237 8.5164 9.6081 11.3522 14.7524 15.4812 21.4342 22.7332 26.6534 26.7737 26.8299 28.0332 29.1505 35.0359 35.2941 39.2187 68.2046 880.0645 electronvolt
chargesum: 1.0000000
charge: 0.658060 -0.316769 0.329377 0.329332
charge: 0.868058 -0.256225 0.194086 0.194081
qa: 0.6581 -0.3168 0.3294 0.3293
va: 2.6740 1.0154 0.8685 0.8685
dispersion: -0.000746496 hartree
energy: -498.205183495156 hartree
dipole: -2.81572 1.29275 -1.52297 0.39117 -0.17981 0.21136 -0.49300 0.35591 -0.13709
magnitude: 1.54367 au
magnitude: 3.92369 debye
