program: Orca
programVersion: 5.0.4
elementType: S F F H H
charge: 0
multiplicity: 1
keywords: SP DSD-BLYP D3BJ def2-QZVPP def2-QZVPP/C def2/J TightSCF
formula: H2F2S
InChI: InChI=1/F2H2S/c1-3-2/h3H2
5 atoms
S  -0.106343 -0.000134 0.005812
F  0.038617 1.689341 -0.175771
F  0.061089 -1.689187 0.169872
H  0.701269 -0.103783 -1.053711
H  0.802434 0.105121 0.979994
totalener: -598.41267988 hartree
nucrepener: 123.97705051 hartree
electener: -722.38973039 hartree
oneelecener: -1076.53898799 hartree
twoeener: 354.14925761 hartree
kineticenergy: 597.74651706 hartree
exchangeener: -14.265235073383 hartree
correlationener: -0.757748375384 hartree
xcener: -15.022983448768 hartree
energy: -2474.6591 -697.8673 -697.8668 -237.3012 -177.3030 -177.0898 -177.0390 -38.6789 -38.2806 -26.1601 -18.2500 -17.8580 -16.8410 -15.0970 -15.0873 -13.6429 -13.3895 -11.3878 1.2248 1.4132 3.1700 3.6409 4.8572 6.1286 7.5977 7.8115 8.2542 9.4045 9.7662 9.7709 11.5140 12.4228 12.7599 12.9734 13.6933 13.8048 14.3626 17.7236 18.1234 20.9383 21.9814 23.2945 24.6267 26.4255 27.0028 27.4888 27.6580 27.9758 29.0071 29.3184 30.4502 30.5002 32.3587 32.5006 33.3174 33.8075 34.4216 35.1044 36.0946 38.0076 41.4185 44.1103 45.5647 46.4637 47.2976 49.6020 49.6895 49.9530 50.4089 51.1080 51.1719 51.6900 52.0656 52.7824 56.3423 56.4256 60.0712 60.2803 63.4825 65.4763 65.8804 66.8061 68.9728 69.0317 69.0358 69.4430 71.6973 72.7003 74.7562 75.1623 75.6736 75.6840 77.2529 77.9894 78.1502 81.8423 82.3960 85.2810 85.9155 89.5026 90.8215 90.8371 93.2541 93.3179 94.4493 95.7164 96.3726 96.7294 96.9335 98.7799 101.2057 103.9455 104.1977 104.8179 109.0320 109.2018 115.5839 115.6028 118.9785 120.5689 120.7752 121.5255 122.3062 123.8930 124.7716 125.2502 127.5138 128.2479 129.8326 131.5158 131.6391 131.8500 143.2637 143.9279 145.8260 146.5608 147.2367 148.3374 149.0004 155.0182 157.9469 158.1890 160.7483 161.5644 162.2789 164.0397 166.0583 166.5315 173.7702 176.7042 176.8085 179.0636 180.2996 181.3678 181.9446 182.8767 183.1170 184.4096 188.0769 188.0888 190.1905 190.2333 191.7730 193.7844 193.9162 196.7512 203.1227 204.6652 210.6322 219.5360 222.3874 222.6211 225.4135 228.7330 228.7874 229.2401 232.0322 234.8385 240.9318 241.3777 242.9584 246.0887 248.5230 249.5164 249.9888 251.0616 251.9027 265.2730 294.2109 299.2213 319.8721 319.9384 320.1551 320.2607 320.2650 320.2703 320.2768 320.3402 320.3645 320.7799 320.9676 321.6043 321.7010 322.4531 323.9752 325.9176 326.4856 328.3779 408.1242 408.2737 408.6597 408.6999 410.5078 410.8235 411.8015 412.5828 414.3437 414.5506 416.9066 418.4713 420.5724 421.6923 432.2700 442.7129 443.0156 443.2815 444.4115 448.7224 450.9201 451.2813 452.0598 453.1041 463.8146 466.3855 684.8865 807.9675 812.2970 812.7767 1498.5565 1501.2652 2315.4834 7813.3244 7816.5563 12349.6478 electronvolt
chargesum: 0.0000000
charge: 0.697268 -0.481914 -0.481991 0.133162 0.133475
charge: 0.581662 -0.146605 -0.146456 -0.144372 -0.144229
qa: 0.6973 -0.4819 -0.4820 0.1332 0.1335
va: 3.3233 0.7212 0.7210 0.9910 0.9907
total: -598.798166162 hartree
dispersion: -0.001494319 hartree
energy: -598.799660480977 hartree
dipole: 1.32144 -0.91273 0.40870 0.00112 -0.00073 0.00038 -0.06386 0.04490 -0.01897
magnitude: 0.40914 au
magnitude: 1.03996 debye
