program: Orca
programVersion: 5.0.4
elementType: S H H
charge: 2
multiplicity: 1
keywords: SP DSD-BLYP D3BJ def2-QZVPP def2-QZVPP/C def2/J TightSCF
formula: H2S
InChI: InChI=1/H2S/h1H2
3 atoms
S  -0.000032 0.055791 0.0000
H  -1.042397 -0.888016 0.0000
H  1.0434 -0.886836 0.0000
totalener: -397.95973311 hartree
nucrepener: 12.29616317 hartree
electener: -410.25589628 hartree
oneelecener: -561.50727992 hartree
twoeener: 151.25138364 hartree
kineticenergy: 397.68713770 hartree
exchangeener: -7.775271271978 hartree
correlationener: -0.345980595642 hartree
xcener: -8.121251867620 hartree
energy: -2493.5674 -256.2241 -196.2604 -195.9109 -195.8612 -43.3568 -32.9290 -30.9153 -21.7231 -13.8725 -12.7193 -8.9945 -8.1912 -8.0780 -7.8679 -7.4802 -6.4606 -6.3998 -3.2914 -2.6189 -0.7653 0.4640 4.3375 4.4803 5.4913 6.2843 9.3423 9.5350 10.5921 10.7917 11.3425 12.4055 12.9313 13.5146 13.9577 14.0732 15.3938 16.3381 18.2762 19.8075 20.6782 20.6855 21.0963 25.4167 32.2668 39.7738 40.3990 41.8086 43.5604 44.8809 45.0584 46.1082 47.8756 50.2784 53.6724 55.0720 56.5489 57.0183 57.3933 57.5246 58.7441 59.2994 59.9771 62.5114 63.7562 67.5598 68.3963 69.5815 71.4239 71.5359 72.7353 72.9179 73.7116 74.7844 76.2149 77.4388 78.1645 79.0768 85.4272 86.3107 88.7052 92.6699 94.1086 98.6639 101.4183 102.8278 144.6350 145.0407 145.0628 146.2977 151.3929 155.2660 155.8779 158.9032 159.2403 162.2224 167.7616 170.1616 170.2787 170.7480 172.3018 175.9760 186.7912 201.4893 201.5024 201.5797 202.0402 202.8558 205.1636 205.7806 209.3659 218.5713 218.5764 219.2693 220.4191 223.6425 223.8980 224.0862 224.9353 227.4765 230.0337 230.7360 259.1083 266.4556 657.1067 778.7943 787.1965 789.1898 2288.3112 12316.5910 electronvolt
chargesum: 2.0000000
charge: 1.238200 0.380906 0.380894
charge: 1.979689 0.010156 0.010154
qa: 1.2382 0.3809 0.3809
va: 1.7008 0.8574 0.8574
total: -398.032985722 hartree
dispersion: -0.000545268 hartree
energy: -398.033530990351 hartree
dipole: 0.00094 -0.00040 0.00054 -1.66672 0.70342 -0.96330 0.00000 0.00000 0.00000
magnitude: 0.96330 au
magnitude: 2.44851 debye
