program: Gaussian 09
title: 000076490
version: EM64L-G09RevD.01
frameworkgroup: C1[X(C4H4N4O2)]
method: RPBEPBE
basis: SDD
operation: Freq
keyword: #pfreq=noraman
keyword: PBEPBE/SDD
title: #p freq=noraman PBEPBE/SDD
converged: YES YES YES YES
title: Mulliken charges:
elementType: O O N N N N C C C C H H H H
charge: -0.215688 -0.215686 -0.046890 -0.046899 0.047294 -0.562518 0.319369 -0.300390 -0.300390 0.035725 0.295232 0.295232 0.347806 0.347805
chargesum: 0.00000
title: Mulliken charges with hydrogens summed into heavy atoms:
elementType: O O N N N N C C C C
charge: -0.215688 -0.215686 -0.046890 -0.046899 0.047294 0.133093 0.319369 -0.005158 -0.005159 0.035725
polarizability: 1.45250736e+02 -3.27284549e-05 8.14352433e+01 1.70652537e-02 1.49484258e-04 3.10847085e+01
1716.lowfreq: -10.6897 -9.6673 -6.9881 -0.0006 0.0004 0.0009 63.4878 90.9534 201.5911
frequency: 63.4860 90.9514 201.5893 262.6283 357.5068 380.3071 407.9396 492.3334 506.5957 574.6808 576.2088 630.7148 631.4421 683.1295 767.8460 801.9850 836.3107 960.2265 964.4240 983.2700 991.1082 1119.5735 1226.3386 1266.4250 1291.4299 1348.4543 1354.1120 1384.1592 1488.1619 1508.6908 1560.8442 1617.8913 3169.0084 3171.6885 3544.1297 3701.0036
redmass: 9.9549 5.4429 7.0178 10.8324 10.0623 3.1920 3.8776 2.2470 6.9227 1.3938 1.0377 8.4028 10.3486 9.7338 12.9299 10.0643 5.8878 1.3704 1.5301 4.9835 1.8369 3.4246 7.6267 1.7340 3.1771 5.6940 2.0049 4.5622 2.7176 8.2490 4.3295 1.7320 1.0932 1.0944 1.0447 1.1060
irintensity: 0.0000 0.4292 0.8159 15.9586 0.2824 14.4050 0.0000 56.0006 8.7543 257.4708 0.0009 2.8133 9.7938 0.8835 11.7656 30.4001 0.1717 0.0000 19.6317 0.0421 3.8240 0.0827 562.1776 27.3063 2.4372 56.7829 6.6402 30.9785 52.2321 99.1691 231.1779 533.5651 0.2614 0.0471 205.7682 64.8658
temp: 298.150 k
press: 1.00000 atm
elementType: 8 8 7 7 7 7 6 6 6 6 1 1 1 1
symmnumber: 1
zpe: 244735.6 jmol-1
zpe.correction: 0.093215 hartree
zpe.thermalcorrener: 0.101324 hartree
zpe.thermalcorrenthalpy: 0.102268 hartree
zpe.thermalcorrgfe: 0.059662 hartree
zpe.sumelectzpe: -523.473370 hartree
zpe.sumelectthermal: -523.465261 hartree
zpe.sumelectthermalent: -523.464317 hartree
zpe.sumelectthermalfe: -523.506923 hartree
dipole: 6.0557 0.0000 0.0013
dipole: 6.0557
quadrupole: -54.4471 -59.8368 -56.9520
quadrupole: 0.0000 -0.0011 0.0001
quadrupole: 2.6315 -2.7581 0.1266 0.0000 -0.0011 0.0001
hfenergy: -523.5665851 hartree
pointgroup: C01 [X(C4H4N4O2)]
dipole: 2.3825024 -0.0001165 0.0005228 debye
dipolederiv: -0.7630692 0.1962924 -0.0000634 0.352188 -0.6769739 -0.000006 -0.0001889 0.0001368 -0.2423065 -0.7631158 -0.196286 -0.0000554 -0.3521809 -0.6769313 0.0000292 -0.0001801 -0.0001187 -0.2423042 -1.0826692 -0.0780845 -0.0001139 0.5612952 -0.3730925 0.0000653 -0.0001048 -0.0000006 -0.2582238 -1.0826751 0.0781524 -0.0001115 -0.5611955 -0.3730316 -0.000069 -0.0001219 -0.0000052 -0.2582221 2.0779731 -0.00004 0.0002848 -0.0000367 1.0987546 -0.0000285 0.0003758 -0.0000216 0.2241779 -1.7454784 0.0000895 -0.000145 0.0000914 -0.1337731 0.0000078 -0.0001262 0.0000077 -0.6635393 -1.1343669 0.0000282 -0.0001995 0.0000054 -0.4788138 -0.0000044 -0.0001092 -0.0000051 0.0858611 0.8119105 0.2032392 0.0000992 0.2549754 0.3815178 0.0000544 0.0001263 0.0000178 0.0352756 0.8118327 -0.2032791 0.0000912 -0.2550066 0.3815578 -0.00004 0.0001351 -0.0000075 0.0352758 2.0827627 -0.0000928 0.0002391 -0.0001234 0.3197233 0.0000005 0.0002326 0.0000018 0.2519734 0.0883496 0.0566297 -0.0000023 0.0424627 0.0713109 0.0000003 -0.0000053 0.0000052 0.1242639 0.0883405 -0.0566347 -0.0000043 -0.0424621 0.0713193 -0.0000038 -0.0000122 -0.0000049 0.1242628 0.3050936 -0.0331154 -0.0000099 -0.1336698 0.1942252 -0.0000211 -0.0000131 -0.0000051 0.3917515 0.3051119 0.0331011 -0.000009 0.1336569 0.1942072 0.0000153 -0.0000082 -0.0000007 0.3917536 unknown
polarizability: 145.250736|-0.0030089|81.4352434|0.0170653|0.0001487|31.0847085 unknown
InChI: InChI=1S/C4H4N4O2/c5-4-6-1-3(2-7-4)8(9)10/h1-2H,5H2
charge 0 multiplicity 1
14 atoms
O  -2.736432 1.144864 -0.000417
O  -2.736529 -1.144668 -0.000369
N  1.409632 1.23633 0.000331
N  1.409516 -1.236513 0.000293
N  -2.131643 0.00007 -0.000048
N  3.397524 -0.000189 0.000553
C  -0.670393 0.000011 0.000099
C  0.057018 1.217717 0.000187
C  0.05691 -1.21777 0.00015
C  2.034141 -0.000112 0.000387
H  -0.465155 2.178936 0.000133
H  -0.465363 -2.178935 0.00007
H  3.894631 -0.88842 0.000602
H  3.894743 0.887979 0.000628
