program: Orca
programVersion: 5.0.4
elementType: N C C S N C C H H H H H H H H H H H H
charge: 2
multiplicity: 1
keywords: Freq RIJCOSX PBEh-3c
frequency: 0.00 0.00 0.00 0.00 0.00 0.00 66.66 115.71 130.73 167.14 169.73 231.83 273.71 324.30 326.02 523.63 530.94 701.77 724.31 760.23 814.71 816.97 878.45 995.57 1007.24 1055.25 1115.65 1138.29 1143.96 1147.99 1164.44 1307.00 1316.70 1340.79 1396.23 1447.91 1454.96 1478.11 1489.89 1502.44 1507.33 1518.62 1520.82 1531.52 1532.09 3097.93 3100.72 3113.39 3116.84 3172.03 3172.71 3192.45 3192.73 3208.16 3209.59 3490.62 3505.17
frequency: 66.66 115.71 130.73 167.14 169.73 231.83 273.71 324.30 326.02 523.63 530.94 701.77 724.31 760.23 814.71 816.97 878.45 995.57 1007.24 1055.25 1115.65 1138.29 1143.96 1147.99 1164.44 1307.00 1316.70 1340.79 1396.23 1447.91 1454.96 1478.11 1489.89 1502.44 1507.33 1518.62 1520.82 1531.52 1532.09 3097.93 3100.72 3113.39 3116.84 3172.03 3172.71 3192.45 3192.73 3208.16 3209.59 3490.62 3505.17
formula: C4H12N2S
InChI: InChI=1/C4H12N2S/c1-3-5-7-6-4-2/h5-6H,3-4H2,1-2H3
19 atoms
N  -1.185405 -1.178433 -0.053023
C  -2.601122 -0.677021 0.040598
C  -2.70159 0.8222 0.134745
S  0.015796 -0.18137 -0.043643
N  1.368177 -0.952553 -0.16004
C  2.677759 -0.212884 -0.178691
C  2.522295 1.280524 -0.072057
H  -1.062476 -2.194039 -0.123836
H  -3.093978 -1.076687 -0.849975
H  -3.015647 -1.183128 0.916769
H  -2.322574 1.338429 -0.751006
H  -3.7599 1.077332 0.198163
H  -2.241236 1.231733 1.037435
H  1.418526 -1.974471 -0.229025
H  3.246713 -0.638545 0.652376
H  3.154184 -0.521749 -1.113279
H  3.521082 1.71721 -0.092647
H  1.985479 1.721147 -0.916002
H  2.07392 1.602505 0.871238
totalener: -665.55548210 hartree
nucrepener: 405.49766576 hartree
electener: -1071.05314786 hartree
oneelecener: -1689.62232207 hartree
twoeener: 618.56917420 hartree
kineticenergy: 662.89127073 hartree
exchangeener: -35.018507887693 hartree
correlationener: -2.891054470354 hartree
xcener: -37.909562358047 hartree
energy: -2453.8025 -411.8986 -411.8938 -294.9730 -294.9722 -292.4491 -292.4487 -239.5101 -182.0997 -182.0170 -181.9419 -42.2250 -39.4811 -34.0091 -32.3475 -31.9505 -29.6169 -28.6085 -28.0405 -25.5373 -25.5323 -24.1728 -24.1247 -24.0159 -22.5718 -21.2561 -21.2206 -20.8593 -20.3895 -20.3046 -20.1391 -19.1850 -13.7010 -9.5270 -9.0115 -7.0415 -4.7249 -4.4592 -4.3947 -3.8191 -3.4373 -3.1782 -3.0456 -2.9555 -2.5904 -2.3129 -1.8772 -1.7772 -1.6964 -1.3098 -0.9143 -0.1291 2.5707 4.0675 4.4347 4.5226 4.6073 5.3538 6.1290 6.2194 6.6869 6.9758 7.3161 7.7790 8.1002 9.3407 9.3420 10.7304 11.8597 13.1410 13.4341 13.9355 14.0517 14.8934 15.4567 16.9455 17.8507 18.1728 18.3253 18.4947 19.4845 19.9797 19.9829 20.2984 20.6062 20.6748 20.7380 21.4069 22.0611 22.8006 23.4213 25.7758 27.4062 29.6307 29.6508 30.3388 33.1706 34.7899 36.3227 36.6268 38.3982 40.0474 42.1344 42.6260 42.7806 42.8567 44.9990 45.1007 48.1224 48.8567 49.0278 49.8320 52.8962 53.7666 54.4225 54.5256 54.5446 56.1694 57.3832 57.7082 57.8661 58.5486 62.2529 63.8365 64.8038 64.9674 361.5356 362.4341 370.3918 370.4130 508.5165 508.6182 electronvolt
chargesum: 2.0000000
charge: -0.628457 -0.305616 -0.750129 1.123128 -0.627883 -0.305524 -0.749559 0.489727 0.354900 0.355040 0.276187 0.370566 0.275993 0.489589 0.354959 0.354919 0.370515 0.275818 0.275826
charge: -0.258288 -0.130388 -0.394939 1.066510 -0.257862 -0.130359 -0.394598 0.323839 0.195891 0.195880 0.161296 0.212111 0.161156 0.323744 0.195864 0.195918 0.211995 0.161113 0.161115
qa: -0.6285 -0.3056 -0.7501 1.1231 -0.6279 -0.3055 -0.7496 0.4897 0.3549 0.3550 0.2762 0.3706 0.2760 0.4896 0.3550 0.3549 0.3705 0.2758 0.2758
va: 3.1218 3.4262 3.6050 3.0682 3.1223 3.4265 3.6051 0.7417 0.8367 0.8366 0.8849 0.8490 0.8849 0.7418 0.8367 0.8366 0.8491 0.8850 0.8850
dispersion: -0.009026230 hartree
energy: -665.533570481314 hartree
dipole: -0.25182 0.38034 0.12851 2.89414 -4.40165 -1.50751 0.15725 -0.26141 -0.10416
magnitude: 1.51655 au
magnitude: 3.85477 debye
temp: 298.15 k
press: 1.00 atm
zeropoint: 0.17141382 hartree
thermalvibcorrection: 0.00637163 hartree
thermalrotcorrection: 0.00141627 hartree
thermaltrasncorrection: 0.00141627 hartree
thermaltotal: -665.35295249 hartree
thermalcorr: 0.00920417 hartree
nonthermalcorr: 0.17141382 hartree
totalcorr: 0.18061799 hartree
thermalcorrenthalpy: 0.00094421 hartree
totalenthalpy: -665.35200828 hartree
vibrat: 0.01115163 hartree
rotat: 0.01354194 hartree
transl: 0.01913198 hartree
total: 0.04382556 hartree
totalentropycorr: -0.04382556 hartree
gibbsenthalpy: -665.39583384 hartree
gibbsminuselec: 0.13773664 hartree
