program: Orca
programVersion: 5.0.4
elementType: N C C S F N C C C C H H H H H H H H H H H H H H H H
charge: 1
multiplicity: 1
keywords: SP DSD-BLYP D3BJ def2-QZVPP def2-QZVPP/C def2/J TightSCF
formula: C6H16FN2S
InChI: InChI=1/C6H16FN2S/c1-4-8-10(7)9(5-2)6-3/h8H,4-6H2,1-3H3
26 atoms
N  1.260479 -0.404548 -0.592893
C  2.577329 0.152558 -0.97379
C  3.63003 0.058494 0.110275
S  0.212494 0.542345 0.164085
F  0.596515 0.349655 1.734188
N  -1.1939 -0.179487 0.025765
C  -1.372139 -1.636436 0.180296
C  -1.593281 -2.328008 -1.151233
C  -2.417852 0.651501 0.121046
C  -2.239379 2.093382 -0.305274
H  1.236454 -1.402424 -0.409805
H  2.418437 1.184754 -1.289305
H  2.873431 -0.3967 -1.866636
H  3.368464 0.644741 0.990083
H  3.798594 -0.972166 0.421794
H  4.575631 0.440273 -0.271989
H  -2.227305 -1.777031 0.84277
H  -0.524198 -2.062107 0.721424
H  -1.756812 -3.392209 -0.98787
H  -2.47231 -1.939575 -1.663799
H  -0.741689 -2.21526 -1.820301
H  -3.140469 0.164495 -0.533418
H  -2.800762 0.592493 1.141654
H  -3.218866 2.568464 -0.310547
H  -1.618905 2.673778 0.378025
H  -1.833647 2.178052 -1.313477
totalener: -844.03769973 hartree
nucrepener: 732.74284170 hartree
electener: -1576.78054143 hartree
oneelecener: -2597.02419630 hartree
twoeener: 1020.24365487 hartree
kineticenergy: 842.49028763 hartree
exchangeener: -26.388304069006 hartree
correlationener: -1.697723502355 hartree
xcener: -28.086027571360 hartree
chargesum: 1.0000000
charge: -0.369378 0.048916 -0.116509 0.898780 -0.332780 -0.255862 0.066426 -0.141306 0.024604 -0.163103 0.202702 0.080684 0.098176 0.060559 0.051252 0.083917 0.092643 0.043268 0.089331 0.062966 0.052320 0.096762 0.093122 0.097400 0.063680 0.071431
charge: 0.352305 -0.003327 0.245831 0.569478 0.055075 0.184652 0.005119 0.250994 0.004577 0.232484 -0.176965 -0.045691 -0.040406 -0.059538 -0.055950 -0.044464 -0.031981 -0.050567 -0.045652 -0.053287 -0.061496 -0.035121 -0.041453 -0.038735 -0.060739 -0.055144
qa: -0.3694 0.0489 -0.1165 0.8988 -0.3328 -0.2559 0.0664 -0.1413 0.0246 -0.1631 0.2027 0.0807 0.0982 0.0606 0.0513 0.0839 0.0926 0.0433 0.0893 0.0630 0.0523 0.0968 0.0931 0.0974 0.0637 0.0714
va: 3.0707 3.8335 3.8758 3.6474 0.9557 3.0165 3.8597 3.8882 3.8255 3.9047 1.0165 0.9883 0.9798 1.0070 1.0042 1.0034 0.9926 0.9994 1.0017 1.0080 1.0091 0.9690 0.9717 1.0009 0.9945 1.0050
total: -845.040471803 hartree
dispersion: -0.015756929 hartree
energy: -845.056228732066 hartree
dipole: -2.49467 2.34347 -0.15120 -3.82361 3.42835 -0.39527 -7.21666 6.56587 -0.65079
magnitude: 0.77629 au
magnitude: 1.97317 debye
