program: Orca
programVersion: 5.0.4
elementType: N C C S N C C C C H H H H H H H H H H H H H H H H
charge: 2
multiplicity: 1
keywords: Opt RIJCOSX PBEh-3c
formula: C6H16N2S
InChI: InChI=1/C6H16N2S/c1-4-7-9-8(5-2)6-3/h7H,4-6H2,1-3H3
25 atoms
N  1.338452 -0.862517 0.169848
C  2.836771 -0.781348 0.131394
C  3.363088 0.630359 0.08659
S  0.4601 0.437009 0.173831
N  -1.05445 0.068736 0.29857
C  -1.613151 -1.303916 0.370595
C  -1.711852 -1.955532 -1.005573
C  -2.023828 1.215249 0.276691
C  -1.407608 2.579798 0.099405
H  0.927942 -1.797317 0.193576
H  3.129065 -1.359242 -0.747955
H  3.171168 -1.318301 1.021931
H  3.109234 1.214051 0.974502
H  4.45138 0.575725 0.06488
H  3.069864 1.170939 -0.815901
H  -1.019871 -1.886116 1.08148
H  -2.60054 -1.189071 0.816695
H  -0.752432 -2.091566 -1.504205
H  -2.36779 -1.394647 -1.668614
H  -2.151645 -2.943659 -0.871452
H  -2.719068 0.974724 -0.53226
H  -2.565504 1.134376 1.222998
H  -2.224362 3.302297 0.096848
H  -0.752056 2.87417 0.921802
H  -0.892908 2.7057 -0.855976
totalener: -744.04539245 hartree
nucrepener: 598.80754374 hartree
electener: -1342.85293619 hartree
oneelecener: -2175.79955243 hartree
twoeener: 832.94661624 hartree
kineticenergy: 740.69825764 hartree
exchangeener: -41.585616361188 hartree
correlationener: -3.574003925161 hartree
xcener: -45.159620286349 hartree
dispersion: -0.013608894 hartree
energy: -2452.8535 -411.5902 -411.0598 -294.7748 -294.6107 -294.4258 -292.2600 -292.1712 -292.0031 -238.5789 -181.1686 -181.0782 -181.0183 -41.5658 -38.9584 -33.7707 -32.9988 -31.7932 -30.5826 -29.1042 -28.4483 -27.7838 -25.8841 -25.1558 -24.9183 -23.8372 -23.7531 -23.1266 -22.6461 -22.1939 -21.3723 -20.8315 -20.7244 -20.1806 -20.0506 -20.0244 -19.8686 -19.8028 -19.6581 -18.4950 -12.9411 -8.8664 -8.3126 -6.0082 -4.9188 -4.4145 -3.9251 -3.7802 -3.4097 -3.3322 -2.9093 -2.8197 -2.5620 -2.4595 -2.1771 -1.9889 -1.9007 -1.7316 -1.6154 -1.4010 -1.3674 -1.1221 -0.8518 -0.6018 -0.2763 0.7262 3.0101 4.3984 4.4943 4.8440 4.8717 5.2654 5.6635 6.0735 6.3683 6.7834 7.0517 7.5055 7.6986 7.9024 8.4626 8.6580 9.3709 9.6508 10.0932 10.6975 11.4936 11.8268 14.1132 14.3002 14.9840 15.5015 16.0783 17.6999 18.0423 18.2248 18.5492 18.6650 18.7685 18.9154 19.3794 20.0859 20.3408 20.4048 20.5519 20.6501 21.0698 21.1992 21.3194 21.5976 22.1206 22.1963 22.9915 23.5320 23.6582 26.1119 27.1772 28.3257 29.5279 30.4944 30.7388 33.5642 33.8885 35.4059 35.9621 37.0516 37.3429 39.2167 40.2335 41.4885 43.0820 43.1160 43.4066 44.2296 45.0226 45.3799 45.6650 46.3590 46.8902 48.1557 49.1959 50.0615 51.2482 52.2725 54.1076 54.6479 55.1111 55.1649 55.9035 56.5128 57.4160 57.7117 58.1239 58.2014 58.4677 59.7073 61.4586 63.4892 63.8667 64.7848 66.4292 67.3001 361.4141 362.6151 363.5116 370.3036 370.8584 371.5021 509.7036 511.4838 electronvolt
chargesum: 2.0000000
charge: -0.653181 -0.296831 -0.745458 1.071047 -0.461090 -0.392122 -0.652062 -0.311768 -0.753005 0.485628 0.341451 0.342431 0.270256 0.361052 0.271010 0.300295 0.358935 0.233480 0.293902 0.335893 0.339013 0.345903 0.363057 0.276623 0.275538
charge: -0.281287 -0.133645 -0.393575 1.027473 -0.139818 -0.159797 -0.361396 -0.134914 -0.396384 0.313888 0.187360 0.187984 0.157497 0.206347 0.157670 0.160506 0.192711 0.139258 0.169293 0.194916 0.186856 0.189823 0.208316 0.160502 0.160417
qa: -0.6532 -0.2968 -0.7455 1.0710 -0.4611 -0.3921 -0.6521 -0.3118 -0.7530 0.4856 0.3415 0.3424 0.2703 0.3611 0.2710 0.3003 0.3589 0.2335 0.2939 0.3359 0.3390 0.3459 0.3631 0.2766 0.2755
va: 3.0936 3.4529 3.6180 3.0518 3.2014 3.4684 3.5989 3.4611 3.6156 0.7481 0.8448 0.8440 0.8877 0.8545 0.8873 0.8729 0.8465 0.9091 0.8842 0.8627 0.8460 0.8412 0.8529 0.8849 0.8858
dispersion: -0.013609452 hartree
energy: -744.017969388022 hartree
dipole: -1.38644 1.38064 -0.00579 -0.79995 0.11305 -0.68690 -1.68291 1.90562 0.22271
magnitude: 0.72213 au
magnitude: 1.83550 debye
