program: Orca
programVersion: 5.0.4
elementType: C C N C C S F N C C C C H H H H H H H H H H H H H H H H H H H H
charge: 1
multiplicity: 1
keywords: SP DSD-BLYP D3BJ def2-QZVPP def2-QZVPP/C def2/J TightSCF
formula: C8H20FN2S
InChI: InChI=1/C8H20FN2S/c1-5-10(6-2)12(9)11(7-3)8-4/h5-8H2,1-4H3
32 atoms
C  2.656858 2.14155 0.466267
C  2.696975 0.627621 0.543332
N  1.37118 -0.034873 0.55212
C  1.360387 -1.464106 0.892768
C  1.892039 -2.382858 -0.19309
S  0.193343 0.733671 -0.209643
F  0.35878 0.296728 -1.771191
N  -1.198673 0.032847 0.177137
C  -2.228056 0.988051 0.65799
C  -3.220667 1.418972 -0.402084
C  -1.663661 -1.238023 -0.421588
C  -2.510121 -2.040777 0.545081
H  2.036785 2.577023 1.249261
H  3.670789 2.509873 0.613168
H  2.328402 2.522357 -0.501227
H  3.294991 0.221293 -0.274058
H  3.166838 0.323777 1.478556
H  1.975224 -1.545976 1.789841
H  0.351161 -1.733705 1.201289
H  1.300774 -2.343134 -1.10741
H  2.9232 -2.149973 -0.454075
H  1.875853 -3.410452 0.167181
H  -2.728056 0.508002 1.498534
H  -1.715917 1.854612 1.079569
H  -2.729451 1.895797 -1.250379
H  -3.820326 0.589263 -0.773822
H  -3.911078 2.14268 0.028698
H  -0.801749 -1.82605 -0.728627
H  -2.222392 -1.014646 -1.332034
H  -2.765809 -2.99174 0.079996
H  -1.981045 -2.25457 1.473699
H  -3.449005 -1.547817 0.792973
totalener: -922.39977090 hartree
nucrepener: 976.28762474 hartree
electener: -1898.68739564 hartree
oneelecener: -3185.92254231 hartree
twoeener: 1287.23514668 hartree
kineticenergy: 920.64225342 hartree
exchangeener: -30.051659629180 hartree
correlationener: -1.979366550447 hartree
xcener: -32.031026179627 hartree
chargesum: 1.0000000
charge: -0.169033 0.043523 -0.309607 0.035710 -0.156999 0.865815 -0.340666 -0.354421 0.057465 -0.158514 0.072563 -0.147323 0.070704 0.095988 0.064039 0.095351 0.090749 0.097534 0.078991 0.062903 0.067549 0.089328 0.094233 0.075413 0.059737 0.060621 0.089812 0.061453 0.097438 0.089753 0.057023 0.062869
charge: 0.230080 0.004603 0.190258 0.002184 0.249650 0.577212 0.062077 0.182148 -0.011426 0.249593 -0.007106 0.251568 -0.056322 -0.039786 -0.060834 -0.043737 -0.035827 -0.034916 -0.048547 -0.063810 -0.054945 -0.045365 -0.040332 -0.047989 -0.056006 -0.056388 -0.044344 -0.051841 -0.043135 -0.043623 -0.057094 -0.056001
qa: -0.1690 0.0435 -0.3096 0.0357 -0.1570 0.8658 -0.3407 -0.3544 0.0575 -0.1585 0.0726 -0.1473 0.0707 0.0960 0.0640 0.0954 0.0907 0.0975 0.0790 0.0629 0.0675 0.0893 0.0942 0.0754 0.0597 0.0606 0.0898 0.0615 0.0974 0.0898 0.0570 0.0629
va: 3.9008 3.8136 3.0301 3.8307 3.8833 3.6300 0.9403 2.9141 3.8165 3.9080 3.7971 3.8985 1.0062 0.9997 0.9953 0.9750 0.9718 0.9823 0.9944 1.0050 1.0041 1.0010 0.9851 0.9847 1.0079 1.0038 1.0032 0.9820 0.9936 1.0017 1.0066 0.9977
total: -923.590651008 hartree
dispersion: -0.021112542 hartree
energy: -923.611763549840 hartree
dipole: -3.33985 3.41239 0.07254 -5.61838 5.52983 -0.08855 6.37098 -5.60731 0.76366
magnitude: 0.77219 au
magnitude: 1.96276 debye
