program: Orca
programVersion: 5.0.4
elementType: C C N C C S N C C C C H H H H H H H H H H H H H H H H H H H H
charge: 2
multiplicity: 1
keywords: SP DSD-BLYP D3BJ def2-QZVPP def2-QZVPP/C def2/J TightSCF
formula: C8H20N2S
InChI: InChI=1/C8H20N2S/c1-5-9(6-2)11-10(7-3)8-4/h5-8H2,1-4H3
31 atoms
C  -2.117511 2.118048 -1.23535
C  -2.392065 0.65467 -0.992324
N  -1.278699 -0.146289 -0.358103
C  -1.660192 -1.523377 0.056861
C  -1.960787 -1.591892 1.546028
S  0.037992 0.671175 -0.120379
N  1.279779 -0.139724 0.388917
C  1.524124 -1.606061 0.451802
C  1.759606 -2.193434 -0.930639
C  2.462031 0.722507 0.764494
C  2.302644 2.210664 0.571753
H  -1.940613 2.686826 -0.321003
H  -3.019388 2.535516 -1.683793
H  -1.314032 2.302833 -1.950983
H  -2.608129 0.129403 -1.925455
H  -3.240812 0.518488 -0.318954
H  -2.547263 -1.756365 -0.530456
H  -0.889886 -2.223839 -0.255923
H  -2.282327 -2.607764 1.775682
H  -2.772242 -0.923823 1.830205
H  -1.0950 -1.371967 2.170791
H  0.706754 -2.08432 0.987442
H  2.408532 -1.713789 1.077964
H  1.975751 -3.255033 -0.811584
H  0.895387 -2.10611 -1.589076
H  2.617984 -1.741363 -1.424762
H  2.651269 0.478718 1.812441
H  3.288111 0.330297 0.167576
H  3.239148 2.669573 0.889879
H  2.156931 2.506692 -0.468189
H  1.525101 2.653939 1.197569
totalener: -822.29031799 hartree
nucrepener: 822.29387518 hartree
electener: -1644.58419317 hartree
oneelecener: -2723.42316899 hartree
twoeener: 1078.83897583 hartree
kineticenergy: 820.74111123 hartree
exchangeener: -26.802706699568 hartree
correlationener: -1.772448649298 hartree
xcener: -28.575155348865 hartree
chargesum: 2.0000000
charge: -0.143943 0.026576 -0.208504 0.028605 -0.142855 0.785404 -0.213158 0.036633 -0.146588 0.028429 -0.147221 0.072898 0.134096 0.069516 0.135854 0.134717 0.131359 0.103622 0.132046 0.086975 0.046676 0.099521 0.130159 0.134211 0.043514 0.092322 0.136937 0.133952 0.135077 0.074299 0.068873
charge: 0.246378 0.055341 0.229414 0.051679 0.275553 0.962128 0.229260 0.051770 0.275171 0.055061 0.246115 -0.048738 -0.016231 -0.049602 -0.018541 -0.017837 -0.017981 -0.044670 -0.024440 -0.042629 -0.058866 -0.043328 -0.018284 -0.024524 -0.059318 -0.042184 -0.018411 -0.017844 -0.016197 -0.049251 -0.048993
qa: -0.1439 0.0266 -0.2085 0.0286 -0.1429 0.7854 -0.2132 0.0366 -0.1466 0.0284 -0.1472 0.0729 0.1341 0.0695 0.1359 0.1347 0.1314 0.1036 0.1320 0.0870 0.0467 0.0995 0.1302 0.1342 0.0435 0.0923 0.1369 0.1340 0.1351 0.0743 0.0689
va: 3.9086 3.7544 3.3018 3.7836 3.8934 3.3660 3.2977 3.7758 3.8915 3.7519 3.9095 0.9983 0.9966 0.9981 0.9647 0.9664 0.9784 0.9949 0.9993 1.0055 1.0065 0.9956 0.9787 0.9984 1.0062 1.0054 0.9633 0.9672 0.9967 0.9979 0.9983
total: -823.346781158 hartree
dispersion: -0.020114043 hartree
energy: -823.366895201607 hartree
dipole: -0.23067 0.22892 -0.00175 -2.80892 2.65600 -0.15293 0.59404 -0.56602 0.02802
magnitude: 0.15548 au
magnitude: 0.39521 debye
