program: Orca
programVersion: 5.0.4
elementType: N S F N C C C C C C H H H H H H H H
charge: 1
multiplicity: 1
keywords: Freq RIJCOSX PBEh-3c
frequency: 0.00 0.00 0.00 0.00 0.00 0.00 49.15 91.91 102.69 252.19 268.23 325.78 339.53 424.71 434.91 462.72 490.02 521.85 525.17 642.71 649.98 729.40 786.83 839.00 858.92 894.03 981.02 990.07 1037.20 1042.60 1051.00 1073.80 1083.20 1128.04 1142.91 1226.47 1235.95 1267.37 1378.61 1404.65 1466.40 1539.15 1578.91 1646.37 1707.19 1710.65 3280.86 3284.15 3290.83 3299.87 3306.27 3560.13 3618.43 3697.69
frequency: 49.15 91.91 102.69 252.19 268.23 325.78 339.53 424.71 434.91 462.72 490.02 521.85 525.17 642.71 649.98 729.40 786.83 839.00 858.92 894.03 981.02 990.07 1037.20 1042.60 1051.00 1073.80 1083.20 1128.04 1142.91 1226.47 1235.95 1267.37 1378.61 1404.65 1466.40 1539.15 1578.91 1646.37 1707.19 1710.65 3280.86 3284.15 3290.83 3299.87 3306.27 3560.13 3618.43 3697.69
formula: C6H8FN2S
InChI: InChI=1/C6H8FN2S/c7-10(8)9-6-4-2-1-3-5-6/h1-5,9H,8H2
18 atoms
N  2.575369 -0.532847 0.415123
S  2.601777 0.627727 -0.682792
F  2.540398 1.977734 0.19282
N  1.152427 0.514521 -1.344588
C  -0.043252 0.192076 -0.613844
C  -0.500733 -1.119452 -0.648173
C  -1.660426 -1.442731 0.03909
C  -2.344219 -0.46361 0.7463
C  -1.876733 0.843308 0.770131
C  -0.718198 1.181681 0.089078
H  3.463753 -0.762562 0.843307
H  1.747807 -0.683503 0.986821
H  1.087902 0.907853 -2.277628
H  0.034875 -1.869719 -1.215385
H  -2.032295 -2.457581 0.015221
H  -3.250775 -0.719301 1.277498
H  -2.41771 1.603885 1.315502
H  -0.360068 2.20272 0.091419
totalener: -839.31173052 hartree
nucrepener: 630.39229605 hartree
electener: -1469.70402657 hartree
oneelecener: -2387.68477951 hartree
twoeener: 917.98075294 hartree
kineticenergy: 835.47877856 hartree
exchangeener: -45.886648399976 hartree
correlationener: -3.755938344307 hartree
xcener: -49.642586744282 hartree
energy: -2448.9484 -688.6598 -405.1689 -404.9692 -289.9967 -288.6327 -288.6271 -288.2872 -288.2783 -288.2597 -234.4019 -177.0393 -176.9655 -176.7952 -42.0071 -35.7106 -33.1982 -30.2966 -27.8814 -27.0560 -26.1737 -23.4354 -23.0792 -22.9586 -22.3828 -21.4216 -20.9511 -20.0023 -19.3169 -19.0173 -18.5625 -17.6657 -17.2883 -16.6832 -15.9321 -15.7892 -15.3257 -15.2302 -14.4369 -12.3300 -12.1510 -4.5592 -4.4104 -3.7179 -3.5692 -2.4708 -0.4499 -0.1202 0.0091 0.2991 1.6340 1.7944 2.0953 2.6676 2.8462 3.4511 4.0050 5.1069 5.4614 5.8468 6.2576 8.4208 8.6296 9.5322 10.4967 11.0700 11.2509 11.4402 11.7638 12.0677 12.2421 12.7902 12.9362 13.0240 13.2629 13.4927 13.5243 13.8866 14.2058 14.5407 15.1486 16.3130 16.6625 17.3356 18.4667 19.9018 20.4413 21.0400 21.2988 21.7629 22.0154 22.3311 22.5955 22.6876 23.1084 23.8092 24.0219 24.6891 25.4015 25.7508 25.8927 26.1695 27.1583 27.6372 28.4390 28.7253 29.4173 29.7366 30.0515 30.4964 30.8842 31.3885 31.7885 32.2003 34.2630 35.7167 36.2851 36.7277 37.2965 37.8008 38.1485 38.4526 40.5348 41.6989 42.9425 44.2632 45.2019 45.5744 46.6084 47.1702 48.1628 50.1251 50.8498 51.9445 53.7514 54.2623 55.2891 55.5807 55.8909 56.1705 57.6366 59.1432 59.8778 60.4451 60.6544 61.2768 62.2547 63.2009 67.2130 67.4872 68.2639 70.4628 70.8533 71.3533 71.8704 72.7931 74.0664 75.8671 81.0758 90.5912 355.9870 367.7171 368.0479 380.6621 381.0394 392.5106 512.5633 519.7043 885.0671 electronvolt
chargesum: 1.0000000
charge: -0.869160 1.269562 -0.388160 -0.828126 0.195919 -0.221356 -0.226677 -0.195989 -0.225565 -0.212608 0.447847 0.453013 0.443026 0.271380 0.272041 0.274116 0.273198 0.267538
charge: -0.512009 1.143661 -0.338940 -0.354965 -0.069410 -0.126528 -0.110801 -0.090749 -0.107561 -0.125736 0.295916 0.293445 0.300913 0.159639 0.161109 0.161780 0.161440 0.158795
qa: -0.8692 1.2696 -0.3882 -0.8281 0.1959 -0.2214 -0.2267 -0.1960 -0.2256 -0.2126 0.4478 0.4530 0.4430 0.2714 0.2720 0.2741 0.2732 0.2675
va: 2.8399 3.4078 0.9725 2.8582 3.5048 3.7922 3.7984 3.7691 3.8009 3.7799 0.7830 0.7848 0.7827 0.8920 0.8923 0.8908 0.8917 0.8953
dispersion: -0.011366040 hartree
energy: -839.292707214971 hartree
dipole: -7.99901 9.27636 1.27735 -5.41204 4.91017 -0.50186 1.86391 -1.93721 -0.07330
magnitude: 1.37435 au
magnitude: 3.49333 debye
temp: 298.15 k
press: 1.00 atm
zeropoint: 0.14288563 hartree
thermalvibcorrection: 0.00647471 hartree
thermalrotcorrection: 0.00141627 hartree
thermaltrasncorrection: 0.00141627 hartree
thermaltotal: -839.14051433 hartree
thermalcorr: 0.00930725 hartree
nonthermalcorr: 0.14288563 hartree
totalcorr: 0.15219288 hartree
thermalcorrenthalpy: 0.00094421 hartree
totalenthalpy: -839.13957012 hartree
vibrat: 0.01082852 hartree
rotat: 0.01422187 hartree
transl: 0.01952981 hartree
total: 0.04458021 hartree
totalentropycorr: -0.04458021 hartree
gibbsenthalpy: -839.18415033 hartree
gibbsminuselec: 0.10855688 hartree
