program: Orca
programVersion: 5.0.4
elementType: N S N C C C C C C H H H H H H H H
charge: 2
multiplicity: 1
keywords: SP DSD-BLYP D3BJ def2-QZVPP def2-QZVPP/C def2/J TightSCF
formula: C6H8N2S
InChI: InChI=1/C6H8N2S/c7-9-8-6-4-2-1-3-5-6/h1-5,8H,7H2
17 atoms
N  2.538178 0.142379 1.049295
S  2.422564 -0.45298 -0.444237
N  0.777258 -0.432759 -0.85246
C  -0.386541 -0.091256 -0.334045
C  -0.547803 0.474655 0.985875
C  -1.798817 0.788603 1.411134
C  -2.917764 0.558404 0.573089
C  -2.785337 0.00654 -0.719117
C  -1.548235 -0.315585 -1.176612
H  2.972157 1.058054 1.145953
H  2.781023 -0.515218 1.787524
H  0.717863 -0.816963 -1.805511
H  0.308832 0.645156 1.618086
H  -1.949927 1.21531 2.393612
H  -3.906809 0.815813 0.936842
H  -3.661463 -0.154389 -1.333028
H  -1.42565 -0.739202 -2.168273
totalener: -739.15578887 hartree
nucrepener: 494.43066139 hartree
electener: -1233.58645026 hartree
oneelecener: -1965.63094467 hartree
twoeener: 732.04449441 hartree
kineticenergy: 737.91043801 hartree
exchangeener: -22.265404035536 hartree
correlationener: -1.381972738250 hartree
xcener: -23.647376773786 hartree
chargesum: 2.0000000
charge: -0.429523 0.545827 -0.150098 0.199030 0.100145 -0.056059 0.104744 -0.067959 0.062394 0.272496 0.272784 0.271038 0.168888 0.174227 0.202000 0.175255 0.154809
charge: 0.432137 0.714793 0.450753 -0.146539 0.196402 0.169058 0.305889 0.166132 0.207121 -0.164093 -0.164048 -0.082021 -0.043900 -0.015582 0.002445 -0.014073 -0.014472
qa: -0.4295 0.5458 -0.1501 0.1990 0.1001 -0.0561 0.1047 -0.0680 0.0624 0.2725 0.2728 0.2710 0.1689 0.1742 0.2020 0.1753 0.1548
va: 3.1074 2.6623 3.4598 3.6197 3.6652 3.8007 3.6824 3.8370 3.7389 0.9653 0.9652 0.9575 0.9717 0.9696 0.9492 0.9696 0.9743
total: -739.953104469 hartree
dispersion: -0.012607176 hartree
energy: -739.965711645077 hartree
dipole: -3.95765 3.49731 -0.46034 1.42667 -1.31239 0.11428 2.42980 -2.26414 0.16566
magnitude: 0.50241 au
magnitude: 1.27702 debye
