program: Orca
programVersion: 5.0.4
elementType: N C C C C C C S N C C C C C C O H H H H H H H H H H H H
charge: 0
multiplicity: 1
keywords: SP DSD-BLYP D3BJ def2-QZVPP def2-QZVPP/C def2/J TightSCF
formula: C12H12N2OS
InChI: InChI=1/C12H12N2OS/c15-16(13-11-7-3-1-4-8-11)14-12-9-5-2-6-10-12/h1-10,13-14H
28 atoms
N  0.991928 -0.837077 1.189265
C  1.741223 -0.024752 0.314216
C  2.721296 -0.599912 -0.49183
C  3.448466 0.196376 -1.362845
C  3.22856 1.564394 -1.424576
C  2.263501 2.137943 -0.609683
C  1.51128 1.347389 0.244024
S  -0.078815 -2.002502 0.539731
N  -1.002905 -1.124289 -0.600334
C  -1.797175 -0.063097 -0.152077
C  -2.643702 -0.231242 0.944128
C  -3.425915 0.823897 1.38669
C  -3.400902 2.047756 0.734941
C  -2.575367 2.208782 -0.368286
C  -1.768055 1.170066 -0.801342
O  0.731229 -2.890612 -0.305899
H  0.539337 -0.330646 1.941088
H  2.923642 -1.657593 -0.419664
H  4.205766 -0.25855 -1.987565
H  3.809609 2.180401 -2.097505
H  2.084547 3.204495 -0.644286
H  0.736348 1.795947 0.854307
H  -0.477224 -0.951719 -1.451646
H  -2.714734 -1.193613 1.434699
H  -4.0768 0.678317 2.238825
H  -4.023325 2.863198 1.077038
H  -2.54803 3.154748 -0.893158
H  -1.103337 1.315432 -1.644104
totalener: -1045.29182682 hartree
nucrepener: 1191.74864421 hartree
electener: -2237.04047103 hartree
oneelecener: -3795.48734918 hartree
twoeener: 1558.44687815 hartree
kineticenergy: 1043.18918002 hartree
exchangeener: -35.148448201079 hartree
correlationener: -2.313303021174 hartree
xcener: -37.461751222253 hartree
chargesum: -0.0000000
charge: -0.447148 0.175361 -0.085397 -0.095708 -0.119445 -0.115684 -0.084432 0.766427 -0.444501 0.176429 -0.121097 -0.093883 -0.127793 -0.100519 -0.078097 -0.578593 0.178298 0.129616 0.099268 0.091196 0.094714 0.099352 0.194002 0.106572 0.099635 0.092430 0.096484 0.092515
charge: 0.337442 -0.276641 0.078372 0.066745 0.058525 0.060212 0.064414 0.343075 0.352468 -0.285182 0.053766 0.063103 0.055347 0.063791 0.069076 -0.120404 -0.205116 -0.054689 -0.057262 -0.061669 -0.059499 -0.056883 -0.191935 -0.063010 -0.056805 -0.062698 -0.057137 -0.057405
qa: -0.4471 0.1754 -0.0854 -0.0957 -0.1194 -0.1157 -0.0844 0.7664 -0.4445 0.1764 -0.1211 -0.0939 -0.1278 -0.1005 -0.0781 -0.5786 0.1783 0.1296 0.0993 0.0912 0.0947 0.0994 0.1940 0.1066 0.0996 0.0924 0.0965 0.0925
va: 2.8631 3.6398 3.7552 3.7860 3.8269 3.8356 3.7284 3.8082 2.9105 3.6745 3.7656 3.8022 3.8353 3.8245 3.7251 1.8655 1.0196 0.9884 0.9843 0.9897 0.9856 0.9806 1.0236 0.9915 0.9840 0.9906 0.9856 0.9892
total: -1046.727874103 hartree
dispersion: -0.025688909 hartree
energy: -1046.753563011491 hartree
dipole: -0.59133 0.14787 -0.44346 10.13642 -8.55594 1.58048 -1.51031 1.79568 0.28537
magnitude: 1.66614 au
magnitude: 4.23499 debye
