program: Orca
programVersion: 5.0.4
elementType: N C C C C C C S N C C C C C C H H H H H H H H H H H H
charge: 2
multiplicity: 1
keywords: Opt RIJCOSX PBEh-3c
formula: C12H12N2S
InChI: InChI=1/C12H12N2S/c1-3-7-11(8-4-1)13-15-14-12-9-5-2-6-10-12/h1-10,13-14H
27 atoms
N  -1.130924 -0.404233 -2.358956
C  -1.373325 0.030285 -1.09484
C  -1.313592 -0.842058 0.026176
C  -1.545636 -0.333355 1.283947
C  -1.825082 1.020864 1.448899
C  -1.942049 1.877555 0.33789
C  -1.726983 1.396923 -0.922315
S  -0.059949 -1.561781 -2.88445
N  1.048136 -1.771495 -1.661973
C  1.340318 -0.955498 -0.615812
C  1.297173 0.461619 -0.728774
C  1.57307 1.231476 0.37854
C  1.883384 0.623778 1.592351
C  1.987044 -0.7766 1.695217
C  1.726396 -1.563982 0.610235
H  -1.371724 0.241302 -3.111852
H  -1.209282 -1.910601 -0.114227
H  -1.537637 -0.993538 2.140084
H  -2.006906 1.412477 2.441525
H  -2.206158 2.916164 0.483293
H  -1.8082 2.053208 -1.781214
H  1.279811 -2.758225 -1.54281
H  1.171359 0.930912 -1.696201
H  1.57598 2.309475 0.296111
H  2.099671 1.236488 2.458136
H  2.27713 -1.228227 2.634118
H  1.798075 -2.642934 0.6869
totalener: -969.77872222 hartree
nucrepener: 1103.87608979 hartree
electener: -2073.65481201 hartree
oneelecener: -3479.80623668 hartree
twoeener: 1406.15142467 hartree
kineticenergy: 964.85057905 hartree
exchangeener: -58.184939375871 hartree
correlationener: -5.025425181077 hartree
xcener: -63.210364556948 hartree
dispersion: -0.023055464 hartree
dispersion: -0.022654011 hartree
dispersion: -0.022920583 hartree
dispersion: -0.023221761 hartree
dispersion: -0.023086228 hartree
dispersion: -0.022807986 hartree
dispersion: -0.023001466 hartree
dispersion: -0.023070272 hartree
dispersion: -0.023062039 hartree
dispersion: -0.023055830 hartree
energy: -2449.9078 -409.8488 -409.8446 -295.0448 -295.0406 -293.3810 -293.3754 -293.0792 -293.0761 -293.0446 -293.0425 -292.5931 -292.5926 -292.5841 -292.5839 -235.7481 -178.3992 -178.2478 -178.0915 -39.6171 -38.0626 -34.8880 -34.2888 -32.5387 -31.5816 -31.5480 -31.1017 -29.9427 -27.9413 -27.8894 -27.5437 -26.5674 -25.4856 -25.4725 -25.0001 -23.8490 -23.6372 -22.7449 -22.6946 -22.4354 -22.0764 -21.8194 -21.7260 -21.6429 -21.3984 -21.0272 -19.8002 -19.6879 -19.4707 -19.2153 -19.0462 -18.9315 -16.9419 -16.4492 -16.3594 -15.8418 -12.3400 -8.4112 -8.1668 -7.9308 -7.5811 -7.3908 -6.5807 -4.7075 -4.6588 -3.7630 -3.7367 -3.1445 -2.8649 -2.3034 -2.0952 -1.8949 -1.8860 -1.3337 -1.2142 -1.1507 -0.8169 -0.1924 0.2031 0.6141 0.7061 1.0336 1.0695 1.2941 1.7642 1.7890 2.3801 2.7878 3.7719 4.0693 4.8081 5.0596 5.5510 5.7558 6.1021 6.8341 6.9395 7.1776 7.3184 7.5985 7.6078 8.2585 8.3270 8.3412 8.6131 8.6229 8.8169 8.9450 8.9563 9.2342 9.3158 9.3519 10.0426 10.4798 10.6555 10.8107 11.5510 11.5622 12.2956 12.5130 12.5925 13.6259 13.6869 14.4077 14.4958 15.8921 16.2608 16.6055 17.0590 17.5032 17.5714 17.8444 17.8881 18.0148 18.0624 18.1695 18.6640 18.9148 19.0521 19.5694 19.5849 19.8087 19.9163 20.3789 20.9956 21.0055 21.4777 21.5532 21.8295 22.1617 22.5573 23.0470 23.1982 23.4836 24.1379 25.2735 25.4698 26.7282 27.2242 27.2504 27.5414 27.9553 28.9814 29.2071 29.6717 30.1111 31.7457 31.9455 32.2045 32.6593 32.6988 33.7222 34.0166 34.0873 34.2222 34.5262 35.3506 36.9995 37.9980 39.0637 40.0447 41.2684 41.7379 42.0178 42.3085 42.4277 44.0227 44.3420 46.0071 46.3054 47.0094 47.3000 47.7316 47.9783 48.6193 48.9117 49.4330 49.9301 50.0057 50.3595 51.6607 52.0673 52.3087 52.3174 53.3675 53.5372 53.7616 54.3227 55.9604 56.1188 56.1356 56.7085 57.2668 57.2720 59.5726 59.8136 60.4999 61.4715 63.3356 63.5860 63.8424 64.1755 65.5381 65.5609 66.6245 66.8065 67.1137 67.3129 67.8101 67.9735 70.0786 70.1823 70.9669 71.9953 77.2751 77.5143 85.4927 85.5116 350.3337 354.6067 362.6213 363.4036 364.2586 368.9227 375.4557 376.0041 378.3394 378.4738 386.0891 388.3696 516.4208 518.2636 electronvolt
chargesum: 2.0000000
charge: -0.750087 0.373827 -0.250920 -0.199280 -0.185502 -0.198489 -0.247950 0.765323 -0.750462 0.375040 -0.250896 -0.198856 -0.185786 -0.197838 -0.248565 0.464306 0.324342 0.316912 0.331846 0.327504 0.310444 0.464387 0.324217 0.316622 0.331964 0.327401 0.310495
charge: -0.242355 0.026949 -0.087684 -0.098873 -0.008533 -0.079064 -0.091565 0.717119 -0.242101 0.027269 -0.087256 -0.099268 -0.008443 -0.078838 -0.091685 0.312585 0.173433 0.182314 0.187968 0.188024 0.177797 0.312661 0.173398 0.182241 0.188012 0.188041 0.177856
qa: -0.7501 0.3738 -0.2509 -0.1993 -0.1855 -0.1985 -0.2479 0.7653 -0.7505 0.3750 -0.2509 -0.1989 -0.1858 -0.1978 -0.2486 0.4643 0.3243 0.3169 0.3318 0.3275 0.3104 0.4644 0.3242 0.3166 0.3320 0.3274 0.3105
va: 3.0354 3.4843 3.7323 3.7767 3.7027 3.7648 3.7573 2.5452 3.0361 3.4832 3.7324 3.7761 3.7029 3.7648 3.7576 0.7641 0.8628 0.8726 0.8616 0.8651 0.8739 0.7641 0.8628 0.8727 0.8615 0.8651 0.8739
dispersion: -0.023059156 hartree
energy: -969.759839466183 hartree
dipole: 0.16606 -0.16421 0.00185 4.25139 -4.31645 -0.06507 7.85318 -7.97210 -0.11893
magnitude: 0.13558 au
magnitude: 0.34461 debye
