program: Orca
programVersion: 5.0.4
elementType: N C C C C C C S N C C C C C C H H H H H H H H H H H H
charge: 2
multiplicity: 1
keywords: SP DSD-BLYP D3BJ def2-QZVPP def2-QZVPP/C def2/J TightSCF
formula: C12H12N2S
InChI: InChI=1/C12H12N2S/c1-3-7-11(8-4-1)13-15-14-12-9-5-2-6-10-12/h1-10,13-14H
27 atoms
N  -1.121447 -0.159672 -1.907217
C  -1.363849 0.274846 -0.643102
C  -1.304115 -0.597497 0.477914
C  -1.53616 -0.088794 1.735685
C  -1.815606 1.265425 1.900637
C  -1.932573 2.122116 0.789629
C  -1.717506 1.641484 -0.470577
S  -0.050473 -1.31722 -2.432712
N  1.057612 -1.526934 -1.210235
C  1.349794 -0.710937 -0.164074
C  1.306649 0.70618 -0.277035
C  1.582546 1.476037 0.830278
C  1.89286 0.868339 2.044089
C  1.99652 -0.532039 2.146955
C  1.735873 -1.319421 1.061973
H  -1.362248 0.485863 -2.660114
H  -1.199805 -1.66604 0.337511
H  -1.528161 -0.748977 2.591822
H  -1.997429 1.657038 2.893264
H  -2.196681 3.160725 0.935031
H  -1.798723 2.297769 -1.329476
H  1.289288 -2.513664 -1.091072
H  1.180835 1.175473 -1.244463
H  1.585457 2.554036 0.747849
H  2.109148 1.481049 2.909875
H  2.286606 -0.983666 3.085856
H  1.807551 -2.398373 1.138638
totalener: -969.54457922 hartree
nucrepener: 1103.91697193 hartree
electener: -2073.46155114 hartree
oneelecener: -3480.75536534 hartree
twoeener: 1407.29381419 hartree
kineticenergy: 967.71239908 hartree
exchangeener: -32.389599754525 hartree
correlationener: -2.119306846632 hartree
xcener: -34.508906601157 hartree
chargesum: 2.0000000
charge: -0.292241 0.210220 0.027678 -0.104576 -0.020859 -0.077124 -0.013035 0.512034 -0.292112 0.207976 0.030958 -0.103218 -0.024364 -0.076201 -0.008767 0.254059 0.138860 0.158830 0.168883 0.162893 0.129944 0.255047 0.136518 0.158849 0.168079 0.162039 0.129629
charge: 0.380431 -0.227093 0.134084 0.123088 0.192760 0.141459 0.140084 0.746300 0.380863 -0.226276 0.134454 0.122792 0.192971 0.141647 0.139942 -0.122034 -0.031985 -0.029540 -0.020228 -0.025021 -0.029916 -0.122029 -0.032126 -0.029620 -0.020195 -0.024962 -0.029851
qa: -0.2922 0.2102 0.0277 -0.1046 -0.0209 -0.0771 -0.0130 0.5120 -0.2921 0.2080 0.0310 -0.1032 -0.0244 -0.0762 -0.0088 0.2541 0.1389 0.1588 0.1689 0.1629 0.1299 0.2550 0.1365 0.1588 0.1681 0.1620 0.1296
va: 3.2917 3.6617 3.7441 3.8421 3.8082 3.8279 3.7783 2.5918 3.2936 3.6599 3.7455 3.8423 3.8172 3.8309 3.7750 0.9648 0.9673 0.9700 0.9676 0.9727 0.9829 0.9640 0.9695 0.9694 0.9686 0.9734 0.9828
total: -970.857351456 hartree
dispersion: -0.027373524 hartree
energy: -970.884724979767 hartree
dipole: 0.16606 -0.16277 0.00329 4.25139 -4.28808 -0.03669 7.85318 -7.91938 -0.06621
magnitude: 0.07576 au
magnitude: 0.19258 debye
